program: Orca
programVersion: 5.0.2
elementType: O O O O N C C C C C C C C C C C C C C C C C C C H H H H H H H H H H H H H H H H H H H H H H H H H
charge: 0
multiplicity: 1
keywords: wb97x-d3
keywords: def2-TZVPP
keywords: def2/J RIJCOSX
keywords: DEFGRID2
keywords: scfconv7
keywords: smallprint printgap noloewdin
keywords: NOSOSCF
formula: C19H25NO4
InChI: InChI=1/C19H25NO4/c1-11(2)9-14-15(19(14,3)4)18(23)24-10-20-16(21)12-7-5-6-8-13(12)17(20)22/h9,14-15H,5-8,10H2,1-4H3
49 atoms
O  -0.325078 1.547839 0.747511
O  -1.369447 2.025922 -1.179477
O  1.469469 0.237069 -1.63849
O  2.904174 1.738933 2.401692
N  1.948849 1.303343 0.346205
C  -3.856936 0.940989 0.43525
C  -3.378405 -0.070037 -0.560126
C  -2.386909 0.554217 0.408288
C  -4.303648 2.289741 -0.073383
C  -4.627521 0.491393 1.654251
C  -3.679835 -1.510633 -0.471977
C  -1.342915 1.448487 -0.120938
C  -3.947254 -2.304425 -1.514195
C  0.862975 2.227268 0.361803
C  -4.261132 -3.756217 -1.318398
C  -3.98469 -1.821962 -2.938921
C  3.285713 -0.488398 -0.209683
C  3.712944 -0.037947 0.970895
C  3.864568 -1.638077 -0.946295
C  4.861629 -0.589862 1.729593
C  4.788564 -2.426372 -0.016083
C  5.679092 -1.507626 0.818551
C  2.136992 0.344564 -0.642107
C  2.851552 1.098745 1.383569
H  -3.301225 0.320946 -1.569088
H  -2.068477 -0.066839 1.23826
H  -4.110514 3.07112 0.664794
H  -3.821932 2.579682 -1.004559
H  -5.380022 2.272169 -0.256716
H  -5.680191 0.339096 1.406699
H  -4.25005 -0.436561 2.082118
H  -4.580101 1.252698 2.435379
H  -3.681901 -1.951529 0.520397
H  1.066401 2.996789 1.103302
H  0.7577 2.695813 -0.614425
H  -3.538139 -4.388049 -1.841725
H  -4.259549 -4.043387 -0.266729
H  -5.241838 -4.004468 -1.73426
H  -3.184278 -1.11857 -3.170823
H  -3.895499 -2.655096 -3.63706
H  -4.929696 -1.320848 -3.164777
H  3.068498 -2.275625 -1.338781
H  4.412457 -1.270192 -1.819748
H  5.479766 0.220043 2.124623
H  4.490597 -1.137356 2.602022
H  4.18333 -3.046667 0.651285
H  5.402487 -3.109724 -0.604612
H  6.294117 -0.896846 0.151347
H  6.368127 -2.100587 1.421631
elementType: O N C H
totalener: -1094.87917179 hartree
nucrepener: 2068.34469306 hartree
electener: -3163.22386485 hartree
oneelecener: -5599.14302775 hartree
twoeener: 2435.91916290 hartree
cpcmener: -0.03192960 hartree
kineticenergy: 1090.03351958 hartree
xcener: -105.969853181853 hartree
chargesum: 0.0000000
charge: -0.282833 -0.460470 -0.407647 -0.409622 -0.100470 0.095626 0.046824 -0.114123 -0.272476 -0.273650 -0.291134 0.416888 -0.015554 0.079531 -0.219868 -0.284915 -0.060753 -0.081755 -0.073088 -0.073953 -0.134600 -0.134232 0.312945 0.324013 0.092022 0.090953 0.097218 0.092336 0.095493 0.098239 0.088617 0.097096 0.113999 0.125123 0.139314 0.093673 0.084272 0.097537 0.100453 0.094559 0.108203 0.094570 0.101047 0.093985 0.101764 0.077684 0.079868 0.077334 0.079957
qa: -0.2828 -0.4605 -0.4076 -0.4096 -0.1005 0.0956 0.0468 -0.1141 -0.2725 -0.2736 -0.2911 0.4169 -0.0156 0.0795 -0.2199 -0.2849 -0.0608 -0.0818 -0.0731 -0.0740 -0.1346 -0.1342 0.3129 0.3240 0.0920 0.0910 0.0972 0.0923 0.0955 0.0982 0.0886 0.0971 0.1140 0.1251 0.1393 0.0937 0.0843 0.0975 0.1005 0.0946 0.1082 0.0946 0.1010 0.0940 0.1018 0.0777 0.0799 0.0773 0.0800
va: 2.1088 2.0517 2.1101 2.1088 3.0967 3.7215 3.7670 3.8196 3.9063 3.9140 3.9061 4.1737 3.7175 3.8659 3.9234 3.9390 3.6572 3.6885 3.9202 3.9205 3.9149 3.9130 4.2276 4.2252 1.0284 1.0350 0.9999 1.0184 1.0001 1.0011 1.0067 1.0018 1.0123 1.0132 1.0181 0.9943 1.0102 0.9931 1.0014 1.0020 0.9934 1.0154 1.0049 1.0155 1.0052 1.0067 1.0098 1.0069 1.0099
dispcorr: -0.022036257 hartree
energy: -1094.901208045376
dipole: -19.43285 20.32121 0.88836 -17.41235 15.85572 -1.55663 -3.82364 4.44126 0.61762
magnitude: 1.89571 au
magnitude: 4.81852 debye
