program: Orca
programVersion: 5.0.2
elementType: O O O O N C C C C C C C C C C C C C C C C C C C H H H H H H H H H H H H H H H H H H H H H H H H H
charge: 0
multiplicity: 1
keywords: wb97x-d3
keywords: def2-TZVPP
keywords: def2/J RIJCOSX
keywords: DEFGRID2
keywords: scfconv7
keywords: smallprint printgap noloewdin
keywords: NOSOSCF
formula: C19H25NO4
InChI: InChI=1/C19H25NO4/c1-11(2)9-14-15(19(14,3)4)18(23)24-10-20-16(21)12-7-5-6-8-13(12)17(20)22/h9,14-15H,5-8,10H2,1-4H3
49 atoms
O  -0.436562 1.718502 1.235582
O  -0.467083 1.37039 -0.974815
O  2.557139 2.314106 -1.225082
O  1.786152 -0.033052 2.600737
N  1.864981 1.387608 0.782042
C  -3.51982 0.85432 -0.478922
C  -2.793669 -0.452062 -0.552965
C  -2.290211 0.618793 0.383749
C  -3.467687 1.786193 -1.66423
C  -4.832696 0.907793 0.263549
C  -3.343841 -1.713428 0.006714
C  -0.991534 1.263379 0.10063
C  -4.201739 -2.512939 -0.627822
C  0.845724 2.312271 1.15929
C  -4.679471 -3.793365 -0.014074
C  -4.744334 -2.213589 -1.991841
C  3.428912 0.208497 -0.426238
C  3.212125 -0.475886 0.695769
C  4.36986 -0.190652 -1.501715
C  3.881803 -1.749084 1.061703
C  4.771439 -1.654442 -1.310927
C  5.090724 -1.971595 0.150385
C  2.587471 1.435297 -0.413132
C  2.212343 0.258033 1.517635
H  -2.179563 -0.567927 -1.442626
H  -2.494161 0.471636 1.438849
H  -3.578773 2.825763 -1.350453
H  -2.542511 1.704112 -2.22808
H  -4.29419 1.560028 -2.340855
H  -5.040317 1.923997 0.603141
H  -5.651748 0.601513 -0.390193
H  -4.850176 0.251991 1.133002
H  -2.996028 -2.005882 0.993265
H  1.029751 2.687984 2.163507
H  0.868227 3.138491 0.447316
H  -5.768234 -3.802587 0.07877
H  -4.413598 -4.650541 -0.637767
H  -4.255819 -3.956781 0.976014
H  -5.836996 -2.219279 -1.983583
H  -4.418376 -1.248432 -2.3750
H  -4.437597 -2.979741 -2.70857
H  3.915482 -0.030274 -2.481833
H  5.24954 0.46075 -1.472482
H  4.177084 -1.735746 2.113275
H  3.166798 -2.572808 0.96629
H  3.953879 -2.297494 -1.649533
H  5.630199 -1.887534 -1.942303
H  5.914896 -1.335118 0.485904
H  5.438394 -3.001621 0.2427
totalener: -1094.85265600 hartree
nucrepener: 2100.69750342 hartree
electener: -3195.55015942 hartree
oneelecener: -5663.56730192 hartree
twoeener: 2468.01714250 hartree
kineticenergy: 1090.10360561 hartree
xcener: -105.972739874525 hartree
chargesum: 0.0000000
charge: -0.262793 -0.383903 -0.305647 -0.315316 -0.126576 0.079816 -0.038642 -0.104903 -0.265094 -0.243371 -0.187132 0.346663 -0.027867 0.092966 -0.211654 -0.237726 -0.076435 -0.094183 -0.078473 -0.074864 -0.134112 -0.137625 0.274248 0.243143 0.108701 0.084185 0.088219 0.107365 0.079753 0.095519 0.085580 0.083451 0.094089 0.123076 0.126018 0.084253 0.085742 0.080229 0.085995 0.081825 0.096237 0.095984 0.091129 0.092545 0.091734 0.076375 0.078380 0.074450 0.078646
qa: -0.2628 -0.3839 -0.3056 -0.3153 -0.1266 0.0798 -0.0386 -0.1049 -0.2651 -0.2434 -0.1871 0.3467 -0.0279 0.0930 -0.2117 -0.2377 -0.0764 -0.0942 -0.0785 -0.0749 -0.1341 -0.1376 0.2742 0.2431 0.1087 0.0842 0.0882 0.1074 0.0798 0.0955 0.0856 0.0835 0.0941 0.1231 0.1260 0.0843 0.0857 0.0802 0.0860 0.0818 0.0962 0.0960 0.0911 0.0925 0.0917 0.0764 0.0784 0.0744 0.0786
va: 2.1302 2.1133 2.2093 2.2013 3.0759 3.7157 3.8263 3.8546 3.9039 3.9090 3.8491 4.2356 3.7358 3.9097 3.9395 3.9385 3.6284 3.6390 3.9251 3.9252 3.8993 3.9011 4.2509 4.2846 1.0247 1.0351 1.0034 1.0215 1.0019 1.0056 1.0026 1.0071 1.0125 0.9937 1.0158 0.9991 0.9978 1.0107 1.0000 1.0112 1.0024 1.0191 1.0078 1.0194 1.0078 1.0082 1.0115 1.0083 1.0115
dispcorr: -0.023584299 hartree
energy: -1094.876240297119
dipole: -22.18394 22.29823 0.11429 -17.52863 16.58332 -0.94530 -9.34825 9.28590 -0.06234
magnitude: 0.95423 au
magnitude: 2.42545 debye
