program: Orca
programVersion: 5.0.2
elementType: O O O O N C C C C C C C C C C C C C C C C C C C H H H H H H H H H H H H H H H H H H H H H H H H H
charge: 0
multiplicity: 1
keywords: wb97x-d3
keywords: def2-TZVPP
keywords: def2/J RIJCOSX
keywords: DEFGRID2
keywords: scfconv7
keywords: smallprint printgap noloewdin
keywords: NOSOSCF
formula: C19H25NO4
InChI: InChI=1/C19H25NO4/c1-11(2)9-14-15(19(14,3)4)18(23)24-10-20-16(21)12-7-5-6-8-13(12)17(20)22/h9,14-15H,5-8,10H2,1-4H3
49 atoms
O  -0.238065 1.178297 0.263467
O  -1.55571 0.856709 2.050617
O  2.828299 2.797733 -0.768847
O  1.798046 -0.916882 1.645136
N  2.035341 1.145566 0.638756
C  -2.578677 -1.474997 0.181405
C  -3.602207 -0.382286 0.291516
C  -2.180385 -0.033248 -0.080285
C  -2.12756 -2.170665 1.443074
C  -2.590475 -2.389076 -1.020469
C  -4.678504 -0.197815 -0.700326
C  -1.331882 0.699988 0.881705
C  -5.976827 -0.015292 -0.449404
C  0.802551 1.725811 1.055255
C  -6.955317 0.167193 -1.571642
C  -6.58588 0.025319 0.919401
C  3.934289 0.654665 -0.565238
C  3.63727 -0.432306 0.146491
C  5.106165 0.789863 -1.466117
C  4.41691 -1.695011 0.143717
C  6.094877 -0.345844 -1.193122
C  5.389235 -1.693398 -1.037615
C  2.905957 1.69737 -0.298735
C  2.395883 -0.169386 0.922219
H  -3.853183 -0.120973 1.313438
H  -1.987999 0.207183 -1.120428
H  -1.088631 -2.495749 1.359972
H  -2.206506 -1.541275 2.325933
H  -2.74224 -3.057001 1.610572
H  -3.319834 -3.189287 -0.883068
H  -2.840111 -1.874654 -1.947326
H  -1.61081 -2.850528 -1.155398
H  -4.372219 -0.20714 -1.742453
H  0.633273 1.525882 2.111959
H  0.854885 2.800992 0.888941
H  -6.473294 0.130056 -2.547916
H  -7.727996 -0.6056 -1.549413
H  -7.472832 1.126457 -1.490165
H  -7.099412 0.975609 1.084753
H  -7.34137 -0.757239 1.025113
H  -5.865927 -0.105243 1.723676
H  4.766069 0.767408 -2.506608
H  5.578779 1.765397 -1.332278
H  4.957681 -1.787696 1.091237
H  3.745231 -2.555414 0.102966
H  6.829156 -0.397092 -1.998319
H  6.652944 -0.12391 -0.278837
H  6.12446 -2.489561 -0.912148
H  4.839593 -1.921101 -1.955514
totalener: -1094.85551894 hartree
nucrepener: 2059.13155861 hartree
electener: -3153.98707755 hartree
oneelecener: -5580.13911127 hartree
twoeener: 2426.15203372 hartree
kineticenergy: 1090.09806504 hartree
xcener: -105.972519012871 hartree
chargesum: -0.0000000
charge: -0.270525 -0.376914 -0.318827 -0.322659 -0.115081 0.080463 0.043269 -0.086618 -0.247289 -0.247021 -0.187955 0.342441 -0.051484 0.072463 -0.202894 -0.235144 -0.102741 -0.067134 -0.074103 -0.075380 -0.134791 -0.133725 0.270761 0.252597 0.088251 0.071852 0.091261 0.096976 0.083377 0.092413 0.069868 0.090712 0.070389 0.137485 0.114537 0.075505 0.082923 0.084366 0.086077 0.084177 0.083842 0.093614 0.093703 0.092636 0.093765 0.079968 0.075660 0.079795 0.075136
qa: -0.2705 -0.3769 -0.3188 -0.3227 -0.1151 0.0805 0.0433 -0.0866 -0.2473 -0.2470 -0.1880 0.3424 -0.0515 0.0725 -0.2029 -0.2351 -0.1027 -0.0671 -0.0741 -0.0754 -0.1348 -0.1337 0.2708 0.2526 0.0883 0.0719 0.0913 0.0970 0.0834 0.0924 0.0699 0.0907 0.0704 0.1375 0.1145 0.0755 0.0829 0.0844 0.0861 0.0842 0.0838 0.0936 0.0937 0.0926 0.0938 0.0800 0.0757 0.0798 0.0751
va: 2.1083 2.1308 2.1955 2.1842 3.0913 3.7605 3.7887 3.8651 3.9126 3.9125 3.9026 4.2270 3.8252 3.8849 3.9349 3.9451 3.6553 3.6094 3.9252 3.9249 3.8975 3.8983 4.2786 4.2752 1.0368 1.0368 1.0073 1.0221 1.0001 1.0044 1.0109 1.0043 1.0212 1.0151 1.0103 1.0123 0.9982 0.9983 0.9991 0.9991 1.0158 1.0084 1.0194 1.0080 1.0195 1.0118 1.0086 1.0118 1.0089
dispcorr: -0.022331699 hartree
energy: -1094.877850640229
dipole: -20.05801 21.02319 0.96518 -15.59750 14.74427 -0.85323 -8.03938 7.12674 -0.91264
magnitude: 1.57876 au
magnitude: 4.01290 debye
