program: Orca
programVersion: 5.0.2
elementType: O O O O N C C C C C C C C C C C C C C C C C C C H H H H H H H H H H H H H H H H H H H H H H H H H
charge: 0
multiplicity: 1
keywords: wb97x-d3
keywords: def2-TZVPP
keywords: def2/J RIJCOSX
keywords: DEFGRID2
keywords: scfconv7
keywords: smallprint printgap noloewdin
keywords: NOSOSCF
formula: C19H25NO4
InChI: InChI=1/C19H25NO4/c1-11(2)9-14-15(19(14,3)4)18(23)24-10-20-16(21)12-7-5-6-8-13(12)17(20)22/h9,14-15H,5-8,10H2,1-4H3
49 atoms
O  -0.475225 1.315992 0.521288
O  -1.690493 3.058366 1.200298
O  2.434054 0.820536 2.47623
O  1.687559 1.164193 -1.999329
N  1.805648 1.290953 0.303382
C  -3.266438 0.529278 -0.689228
C  -2.756467 -0.425679 0.350418
C  -2.815709 1.044027 0.667575
C  -2.432683 0.786515 -1.921643
C  -4.75053 0.606026 -0.952373
C  -3.644255 -1.362822 1.088738
C  -1.631261 1.916102 0.831106
C  -4.20385 -2.45867 0.574574
C  0.689157 2.131395 0.553284
C  -5.06568 -3.35859 1.40731
C  -4.021481 -2.889791 -0.848641
C  3.515561 -0.224793 0.580999
C  3.298933 -0.122055 -0.730121
C  4.540262 -1.093738 1.211787
C  4.058943 -0.845052 -1.780034
C  5.056054 -2.101872 0.183114
C  5.327901 -1.446095 -1.171205
C  2.556078 0.659416 1.295063
C  2.180647 0.832596 -0.956987
H  -1.756485 -0.804652 0.156831
H  -3.62936 1.369421 1.307644
H  -2.595321 1.798435 -2.29825
H  -1.36437 0.65984 -1.759548
H  -2.725777 0.095556 -2.714726
H  -5.01729 1.588693 -1.345761
H  -5.048919 -0.139583 -1.691917
H  -5.342061 0.429774 -0.05511
H  -3.824592 -1.136384 2.135982
H  0.809985 2.602126 1.528535
H  0.630439 2.904247 -0.213873
H  -5.178115 -2.990929 2.42649
H  -6.063502 -3.458255 0.972643
H  -4.646985 -4.366956 1.458472
H  -4.985846 -2.96689 -1.357084
H  -3.39295 -2.210178 -1.420788
H  -3.568567 -3.883648 -0.89504
H  5.357949 -0.472718 1.591759
H  4.12293 -1.59871 2.08583
H  3.42498 -1.627861 -2.209177
H  4.297839 -0.172912 -2.607191
H  5.962109 -2.580694 0.557021
H  4.314631 -2.896443 0.057708
H  5.759254 -2.173424 -1.860611
H  6.075007 -0.656787 -1.046723
totalener: -1094.85293316 hartree
nucrepener: 2089.01066870 hartree
electener: -3183.86360186 hartree
oneelecener: -5639.59737728 hartree
twoeener: 2455.73377542 hartree
kineticenergy: 1090.09339636 hartree
xcener: -105.969815034542 hartree
chargesum: -0.0000000
charge: -0.268200 -0.360019 -0.313648 -0.323261 -0.120722 0.055263 0.013622 -0.080007 -0.256390 -0.252282 -0.219571 0.322448 -0.012995 0.074438 -0.210455 -0.250734 -0.091525 -0.076361 -0.073026 -0.076670 -0.136807 -0.133803 0.260529 0.252324 0.100126 0.086062 0.097578 0.091740 0.078643 0.101337 0.081094 0.084357 0.091601 0.126833 0.127571 0.080661 0.084258 0.085469 0.089554 0.084335 0.097256 0.093150 0.095225 0.093583 0.094580 0.080371 0.076291 0.080582 0.075594
qa: -0.2682 -0.3600 -0.3136 -0.3233 -0.1207 0.0553 0.0136 -0.0800 -0.2564 -0.2523 -0.2196 0.3224 -0.0130 0.0744 -0.2105 -0.2507 -0.0915 -0.0764 -0.0730 -0.0767 -0.1368 -0.1338 0.2605 0.2523 0.1001 0.0861 0.0976 0.0917 0.0786 0.1013 0.0811 0.0844 0.0916 0.1268 0.1276 0.0807 0.0843 0.0855 0.0896 0.0843 0.0973 0.0931 0.0952 0.0936 0.0946 0.0804 0.0763 0.0806 0.0756
va: 2.0852 2.1421 2.2002 2.1858 3.1155 3.7390 3.7842 3.8563 3.9133 3.9085 3.8751 4.2639 3.7292 3.9050 3.9376 3.9368 3.6346 3.6304 3.9246 3.9277 3.8996 3.8964 4.2735 4.2667 1.0215 1.0302 1.0031 1.0169 1.0047 1.0057 1.0015 1.0075 1.0140 1.0089 0.9996 1.0108 0.9990 0.9983 0.9984 1.0093 1.0042 1.0081 1.0191 1.0085 1.0186 1.0118 1.0086 1.0118 1.0087
dispcorr: -0.023884100 hartree
energy: -1094.876817257366
dipole: -17.04184 17.94532 0.90348 -21.39649 19.68947 -1.70702 -8.73959 8.01367 -0.72592
magnitude: 2.06329 au
magnitude: 5.24446 debye
