program: Orca
programVersion: 5.0.2
elementType: O O O O N C C C C C C C C C C C C C C C C C C C H H H H H H H H H H H H H H H H H H H H H H H H H
charge: 0
multiplicity: 1
keywords: wb97x-d3
keywords: def2-TZVPP
keywords: def2/J RIJCOSX
keywords: DEFGRID2
keywords: scfconv7
keywords: smallprint printgap noloewdin
keywords: NOSOSCF
formula: C19H25NO4
InChI: InChI=1/C19H25NO4/c1-11(2)9-14-15(19(14,3)4)18(23)24-10-20-16(21)12-7-5-6-8-13(12)17(20)22/h9,14-15H,5-8,10H2,1-4H3
49 atoms
O  -0.352102 0.43481 -0.566097
O  -1.856145 0.941785 -2.134744
O  2.415722 2.48431 -0.189141
O  2.047601 -1.956745 -1.114357
N  1.917432 0.337597 -0.881546
C  -3.630473 1.503477 0.420321
C  -4.035555 0.22973 -0.238848
C  -2.576506 0.455077 0.097029
C  -3.700197 2.788774 -0.366838
C  -3.918805 1.688148 1.891029
C  -4.818662 -0.81351 0.472157
C  -1.602357 0.644728 -0.9959
C  -4.672707 -2.129182 0.310175
C  0.679718 0.577031 -1.534146
C  -5.530105 -3.106866 1.055288
C  -3.663803 -2.738153 -0.614526
C  3.805745 0.595075 0.408137
C  3.698894 -0.70511 0.135409
C  4.892572 1.212488 1.20822
C  4.659708 -1.749997 0.568834
C  5.663798 0.119868 1.951786
C  5.949006 -1.086496 1.056873
C  2.663167 1.311601 -0.219751
C  2.476944 -0.923494 -0.684087
H  -4.250407 0.326244 -1.300745
H  -2.189256 -0.083511 0.954421
H  -2.965353 3.510309 -0.004731
H  -3.531457 2.642985 -1.430999
H  -4.688076 3.237575 -0.246508
H  -4.929168 2.074973 2.040327
H  -3.834169 0.757778 2.452445
H  -3.223087 2.405246 2.329702
H  -5.589429 -0.461494 1.152266
H  0.68271 1.584492 -1.950266
H  0.551054 -0.144196 -2.341498
H  -6.234397 -2.609983 1.72157
H  -6.102621 -3.732293 0.365984
H  -4.91949 -3.785531 1.656174
H  -4.153749 -3.400583 -1.332658
H  -3.098407 -1.999781 -1.178714
H  -2.951733 -3.355807 -0.060601
H  5.557343 1.773639 0.543413
H  4.481693 1.947854 1.903618
H  4.206688 -2.350431 1.364448
H  4.858396 -2.446052 -0.249143
H  6.597659 0.527573 2.341507
H  5.081129 -0.203998 2.819144
H  6.560174 -1.814844 1.591724
H  6.536347 -0.763637 0.192379
totalener: -1094.85622251 hartree
nucrepener: 2055.33193809 hartree
electener: -3150.18816059 hartree
oneelecener: -5572.47231815 hartree
twoeener: 2422.28415756 hartree
kineticenergy: 1090.09568495 hartree
xcener: -105.970687204611 hartree
chargesum: -0.0000000
charge: -0.259913 -0.387530 -0.316746 -0.317061 -0.126233 0.128242 -0.019909 -0.101299 -0.260230 -0.273831 -0.238419 0.325673 -0.004662 0.092855 -0.211425 -0.225033 -0.090896 -0.090700 -0.072579 -0.076126 -0.135488 -0.134432 0.261807 0.265705 0.106078 0.084801 0.089446 0.100883 0.083664 0.090120 0.084600 0.092758 0.092493 0.122812 0.122672 0.078629 0.087033 0.083999 0.089452 0.083949 0.089023 0.092334 0.094681 0.093403 0.094114 0.079709 0.076153 0.079998 0.075424
qa: -0.2599 -0.3875 -0.3167 -0.3171 -0.1262 0.1282 -0.0199 -0.1013 -0.2602 -0.2738 -0.2384 0.3257 -0.0047 0.0929 -0.2114 -0.2250 -0.0909 -0.0907 -0.0726 -0.0761 -0.1355 -0.1344 0.2618 0.2657 0.1061 0.0848 0.0894 0.1009 0.0837 0.0901 0.0846 0.0928 0.0925 0.1228 0.1227 0.0786 0.0870 0.0840 0.0895 0.0839 0.0890 0.0923 0.0947 0.0934 0.0941 0.0797 0.0762 0.0800 0.0754
va: 2.1115 2.1105 2.1983 2.1982 3.1162 3.7430 3.8212 3.8422 3.9020 3.9107 3.8973 4.1932 3.7343 3.8994 3.9413 3.9423 3.6277 3.6232 3.9263 3.9278 3.8990 3.8972 4.2768 4.2743 1.0262 1.0303 1.0016 1.0196 1.0022 1.0013 1.0047 1.0064 1.0099 1.0046 1.0025 1.0096 0.9988 0.9993 1.0016 1.0176 1.0010 1.0082 1.0188 1.0082 1.0190 1.0117 1.0086 1.0119 1.0088
dispcorr: -0.022408449 hartree
energy: -1094.878630956014
dipole: -16.51058 17.56469 1.05411 -6.16954 5.69657 -0.47297 12.71918 -11.50606 1.21312
magnitude: 1.67526 au
magnitude: 4.25817 debye
