program: Orca
programVersion: 5.0.2
elementType: O O O O N C C C C C C C C C C C C C C C C C C C H H H H H H H H H H H H H H H H H H H H H H H H H
charge: 0
multiplicity: 1
keywords: wb97x-d3
keywords: def2-TZVPP
keywords: def2/J RIJCOSX
keywords: DEFGRID2
keywords: scfconv7
keywords: smallprint printgap noloewdin
keywords: NOSOSCF
formula: C19H25NO4
InChI: InChI=1/C19H25NO4/c1-11(2)9-14-15(19(14,3)4)18(23)24-10-20-16(21)12-7-5-6-8-13(12)17(20)22/h9,14-15H,5-8,10H2,1-4H3
49 atoms
O  -0.112766 0.827228 -0.04487
O  -1.575439 2.158881 -1.08028
O  2.445199 0.022089 -2.151106
O  2.492062 1.634487 2.105169
N  2.165907 1.069741 -0.11185
C  -3.680214 0.420212 0.47388
C  -3.563883 -0.079511 -0.931494
C  -2.312199 0.096075 -0.107682
C  -4.10913 1.848713 0.701168
C  -4.16205 -0.524898 1.5477
C  -3.974837 -1.446367 -1.345803
C  -1.340285 1.146251 -0.474619
C  -5.234128 -1.845169 -1.529129
C  0.935535 1.732947 -0.36355
C  -5.553804 -3.237672 -1.981161
C  -6.420201 -0.955791 -1.314526
C  3.944366 -0.379648 -0.294984
C  3.9572 0.091313 0.951623
C  4.935389 -1.328863 -0.860013
C  4.953433 -0.272331 1.990053
C  6.149907 -1.409495 0.066845
C  5.739487 -1.504646 1.536728
C  2.787945 0.212627 -1.018257
C  2.811279 1.025489 1.122943
H  -3.693294 0.691054 -1.688234
H  -1.860924 -0.811344 0.27915
H  -3.769508 2.52388 -0.079544
H  -5.199498 1.899296 0.73519
H  -3.735848 2.222947 1.656182
H  -3.780321 -0.220266 2.523509
H  -5.25241 -0.519003 1.601732
H  -3.851429 -1.553143 1.369251
H  -3.176512 -2.158024 -1.536134
H  0.872445 2.623498 0.262324
H  0.891028 2.026077 -1.411999
H  -4.656477 -3.838947 -2.122177
H  -6.192241 -3.749221 -1.256513
H  -6.102011 -3.227858 -2.926452
H  -7.099823 -1.387191 -0.575301
H  -6.146524 0.042052 -0.977044
H  -6.995351 -0.85111 -2.237986
H  4.468201 -2.31225 -0.975696
H  5.225622 -1.020284 -1.866741
H  5.624906 0.575592 2.160215
H  4.456645 -0.451035 2.946284
H  6.767331 -2.266387 -0.206347
H  6.771088 -0.52088 -0.078073
H  6.621408 -1.632067 2.166027
H  5.123217 -2.396586 1.681642
totalener: -1094.85578791 hartree
nucrepener: 2033.60353614 hartree
electener: -3128.45932405 hartree
oneelecener: -5528.99953067 hartree
twoeener: 2400.54020662 hartree
kineticenergy: 1090.09595690 hartree
xcener: -105.970528547179 hartree
chargesum: 0.0000000
charge: -0.264242 -0.390490 -0.315604 -0.316924 -0.127917 0.065594 -0.029558 -0.083906 -0.262969 -0.245296 -0.184258 0.346168 -0.023844 0.092305 -0.209545 -0.243557 -0.085104 -0.092624 -0.076244 -0.074156 -0.134710 -0.136189 0.261955 0.263094 0.108370 0.078332 0.106066 0.079357 0.088176 0.098819 0.083293 0.083218 0.090201 0.123802 0.123093 0.079447 0.083805 0.086176 0.087824 0.083320 0.098192 0.093159 0.094049 0.092603 0.094876 0.080154 0.075445 0.080378 0.075867
qa: -0.2642 -0.3905 -0.3156 -0.3169 -0.1279 0.0656 -0.0296 -0.0839 -0.2630 -0.2453 -0.1843 0.3462 -0.0238 0.0923 -0.2095 -0.2436 -0.0851 -0.0926 -0.0762 -0.0742 -0.1347 -0.1362 0.2620 0.2631 0.1084 0.0783 0.1061 0.0794 0.0882 0.0988 0.0833 0.0832 0.0902 0.1238 0.1231 0.0794 0.0838 0.0862 0.0878 0.0833 0.0982 0.0932 0.0940 0.0926 0.0949 0.0802 0.0754 0.0804 0.0759
va: 2.1166 2.1093 2.1987 2.1975 3.1189 3.7389 3.8197 3.8719 3.9060 3.9063 3.8594 4.2146 3.7367 3.8970 3.9372 3.9349 3.6150 3.6335 3.9275 3.9256 3.8966 3.8988 4.2783 4.2776 1.0256 1.0339 1.0217 1.0027 1.0032 1.0060 1.0023 1.0072 1.0128 1.0024 1.0060 1.0106 0.9989 0.9985 0.9987 1.0112 1.0038 1.0083 1.0191 1.0080 1.0189 1.0118 1.0087 1.0116 1.0088
dispcorr: -0.022551627 hartree
energy: -1094.878339536822
dipole: -23.65399 24.40375 0.74977 -14.93165 13.69418 -1.23747 2.50048 -1.95909 0.54139
magnitude: 1.54486 au
magnitude: 3.92672 debye
