program: Orca
programVersion: 5.0.2
elementType: O O O O N C C C C C C C C C C C C C C C C C C C H H H H H H H H H H H H H H H H H H H H H H H H H
charge: 0
multiplicity: 1
keywords: wb97x-d3
keywords: def2-TZVPP
keywords: def2/J RIJCOSX
keywords: DEFGRID2
keywords: scfconv7
keywords: smallprint printgap noloewdin
keywords: NOSOSCF
formula: C19H25NO4
InChI: InChI=1/C19H25NO4/c1-11(2)9-14-15(19(14,3)4)18(23)24-10-20-16(21)12-7-5-6-8-13(12)17(20)22/h9,14-15H,5-8,10H2,1-4H3
49 atoms
O  -0.262981 1.155577 -0.266069
O  -1.821607 1.532853 -1.823619
O  2.838606 2.529501 0.602099
O  1.657211 -1.183734 -1.746366
N  1.963042 0.879485 -0.756726
C  -3.846262 1.214893 0.52822
C  -3.67951 -0.119166 -0.128988
C  -2.450286 0.663048 0.31746
C  -4.362642 2.361371 -0.308157
C  -4.307913 1.29445 1.964892
C  -3.995346 -1.398625 0.528269
C  -1.525348 1.1685 -0.71609
C  -4.383136 -2.531733 -0.062611
C  0.763521 1.509743 -1.183824
C  -4.658998 -3.7621 0.750298
C  -4.574066 -2.710315 -1.537874
C  3.85254 0.337975 0.440354
C  3.510278 -0.748583 -0.251669
C  5.022071 0.436827 1.349092
C  4.252037 -2.034223 -0.246828
C  5.558285 -0.965746 1.644558
C  5.6312 -1.826285 0.382515
C  2.867265 1.416705 0.156932
C  2.275028 -0.452692 -1.024887
H  -3.828156 -0.091675 -1.202542
H  -1.95998 0.298711 1.213006
H  -3.991135 3.316424 0.06839
H  -4.082438 2.284265 -1.354969
H  -5.45256 2.38702 -0.252202
H  -3.875208 0.522255 2.599461
H  -4.032198 2.258316 2.39567
H  -5.393607 1.200892 2.02402
H  -3.88261 -1.419086 1.607894
H  0.909165 2.58999 -1.184094
H  0.516313 1.178201 -2.191365
H  -5.689824 -4.099961 0.615789
H  -4.017676 -4.590216 0.438217
H  -4.498346 -3.597076 1.81505
H  -4.371297 -1.814965 -2.120316
H  -3.919485 -3.499972 -1.914526
H  -5.597301 -3.024595 -1.758183
H  5.793633 1.057243 0.881763
H  4.744322 0.955509 2.269363
H  3.677406 -2.780345 0.311656
H  4.336372 -2.427691 -1.262234
H  6.543239 -0.894584 2.108101
H  4.905742 -1.452109 2.375484
H  6.081637 -2.792913 0.612502
H  6.288918 -1.343483 -0.346005
totalener: -1094.85607839 hartree
nucrepener: 2045.86923831 hartree
electener: -3140.72531670 hartree
oneelecener: -5553.56527345 hartree
twoeener: 2412.83995675 hartree
kineticenergy: 1090.09320022 hartree
xcener: -105.971490604673 hartree
chargesum: -0.0000000
charge: -0.266596 -0.393676 -0.317829 -0.315262 -0.124902 0.089376 0.029417 -0.079675 -0.253484 -0.257348 -0.180351 0.352607 -0.049127 0.090214 -0.204657 -0.236904 -0.095524 -0.080992 -0.075880 -0.075007 -0.134793 -0.135522 0.264809 0.258345 0.090876 0.069990 0.083081 0.102545 0.083860 0.073349 0.091412 0.094187 0.070271 0.120401 0.125658 0.084021 0.084591 0.074951 0.085280 0.087484 0.084436 0.092450 0.094912 0.093587 0.094083 0.079416 0.075825 0.080318 0.075776
qa: -0.2666 -0.3937 -0.3178 -0.3153 -0.1249 0.0894 0.0294 -0.0797 -0.2535 -0.2573 -0.1804 0.3526 -0.0491 0.0902 -0.2047 -0.2369 -0.0955 -0.0810 -0.0759 -0.0750 -0.1348 -0.1355 0.2648 0.2583 0.0909 0.0700 0.0831 0.1025 0.0839 0.0733 0.0914 0.0942 0.0703 0.1204 0.1257 0.0840 0.0846 0.0750 0.0853 0.0875 0.0844 0.0925 0.0949 0.0936 0.0941 0.0794 0.0758 0.0803 0.0758
va: 2.1144 2.1060 2.1959 2.1969 3.1147 3.7386 3.8088 3.8634 3.9079 3.9192 3.9181 4.2010 3.8312 3.8950 3.9339 3.9440 3.6421 3.6146 3.9262 3.9267 3.8988 3.8967 4.2788 4.2802 1.0287 1.0361 1.0032 1.0231 1.0000 1.0103 1.0041 1.0029 1.0215 1.0033 1.0099 0.9980 0.9983 1.0123 1.0170 0.9993 0.9982 1.0082 1.0190 1.0085 1.0189 1.0118 1.0087 1.0118 1.0087
dispcorr: -0.021464844 hartree
energy: -1094.877543237003
dipole: -19.21121 20.11472 0.90351 -13.82693 12.88360 -0.94332 8.87083 -7.94709 0.92374
magnitude: 1.59984 au
magnitude: 4.06647 debye
