program: Orca
programVersion: 5.0.2
elementType: O O O O N C C C C C C C C C C C C C C C C C C C H H H H H H H H H H H H H H H H H H H H H H H H H
charge: 0
multiplicity: 1
keywords: wb97x-d3
keywords: def2-TZVPP
keywords: def2/J RIJCOSX
keywords: DEFGRID2
keywords: scfconv7
keywords: smallprint printgap noloewdin
keywords: NOSOSCF
formula: C19H25NO4
InChI: InChI=1/C19H25NO4/c1-11(2)9-14-15(19(14,3)4)18(23)24-10-20-16(21)12-7-5-6-8-13(12)17(20)22/h9,14-15H,5-8,10H2,1-4H3
49 atoms
O  -0.58531 2.02017 1.002163
O  -0.12314 -0.112908 1.500831
O  2.829653 0.682841 2.377625
O  1.168172 2.450521 -1.475529
N  1.751242 1.799835 0.661256
C  -2.353454 -0.413688 -0.748072
C  -2.80825 -0.923224 0.58909
C  -2.217483 0.453698 0.493535
C  -1.127982 -1.016439 -1.390515
C  -3.394595 0.026268 -1.746866
C  -4.24515 -1.089808 0.928079
C  -0.879508 0.71371 1.066123
C  -4.967645 -2.176758 0.654955
C  0.709048 2.440269 1.396652
C  -6.405896 -2.283639 1.061029
C  -4.41219 -3.370737 -0.060088
C  3.323906 0.230162 0.056628
C  2.854178 0.762463 -1.070675
C  4.37178 -0.817047 0.135761
C  3.282912 0.377824 -2.438394
C  5.063121 -0.954764 -1.222048
C  4.060922 -0.938342 -2.376661
C  2.639622 0.869949 1.210832
C  1.824816 1.779493 -0.727648
H  -2.140062 -1.651033 1.04234
H  -2.898296 1.297856 0.534042
H  -0.407974 -1.389341 -0.665022
H  -1.418944 -1.854311 -2.027472
H  -0.623398 -0.2833 -2.024273
H  -2.971571 0.743579 -2.451942
H  -3.759498 -0.830059 -2.317838
H  -4.258791 0.489362 -1.272639
H  -4.726088 -0.269053 1.452482
H  0.888877 2.250163 2.455976
H  0.712329 3.512195 1.212355
H  -6.564222 -3.137301 1.724822
H  -6.753452 -1.390068 1.577983
H  -7.049419 -2.44236 0.192044
H  -4.444314 -4.256484 0.579497
H  -5.011306 -3.606086 -0.943288
H  -3.382904 -3.229522 -0.384239
H  5.089613 -0.577277 0.923372
H  3.90964 -1.763047 0.43598
H  2.415169 0.291183 -3.096466
H  3.899765 1.17501 -2.865883
H  5.772255 -0.131468 -1.348848
H  5.649373 -1.874518 -1.246971
H  3.355479 -1.765415 -2.254137
H  4.575861 -1.108232 -3.323442
totalener: -1094.85125578 hartree
nucrepener: 2144.80956920 hartree
electener: -3239.66082498 hartree
oneelecener: -5751.68416319 hartree
twoeener: 2512.02333821 hartree
kineticenergy: 1090.10374390 hartree
xcener: -105.973529364750 hartree
chargesum: -0.0000000
charge: -0.256634 -0.378069 -0.307958 -0.314538 -0.124021 0.108785 -0.024938 -0.094739 -0.294871 -0.249510 -0.193229 0.331765 -0.027623 0.090944 -0.211681 -0.235782 -0.035677 -0.108078 -0.072416 -0.083028 -0.137884 -0.130965 0.255560 0.230123 0.108942 0.078966 0.097594 0.088592 0.093782 0.101619 0.085602 0.081180 0.089178 0.127601 0.119578 0.086288 0.079313 0.083688 0.096631 0.084654 0.080243 0.092673 0.096492 0.091212 0.093672 0.074153 0.079013 0.075577 0.078226
qa: -0.2566 -0.3781 -0.3080 -0.3145 -0.1240 0.1088 -0.0249 -0.0947 -0.2949 -0.2495 -0.1932 0.3318 -0.0276 0.0909 -0.2117 -0.2358 -0.0357 -0.1081 -0.0724 -0.0830 -0.1379 -0.1310 0.2556 0.2301 0.1089 0.0790 0.0976 0.0886 0.0938 0.1016 0.0856 0.0812 0.0892 0.1276 0.1196 0.0863 0.0793 0.0837 0.0966 0.0847 0.0802 0.0927 0.0965 0.0912 0.0937 0.0742 0.0790 0.0756 0.0782
va: 2.1315 2.1252 2.2063 2.1953 3.0727 3.7189 3.8151 3.8658 3.9006 3.9038 3.8580 4.2737 3.7413 3.9173 3.9404 3.9384 3.5917 3.6498 3.9115 3.9271 3.9010 3.8963 4.2643 4.2661 1.0252 1.0341 1.0170 1.0052 1.0075 1.0046 1.0022 1.0075 1.0135 1.0135 0.9932 0.9978 1.0107 0.9988 1.0017 1.0003 1.0110 1.0197 1.0082 1.0186 1.0081 1.0080 1.0116 1.0095 1.0117
dispcorr: -0.025524959 hartree
energy: -1094.876780733779
dipole: -18.88232 18.96786 0.08554 -20.92403 20.36335 -0.56068 -13.11176 12.16240 -0.94936
magnitude: 1.10588 au
magnitude: 2.81092 debye
