program: Orca
programVersion: 5.0.2
elementType: O O O O N C C C C C C C C C C C C C C C C C C C H H H H H H H H H H H H H H H H H H H H H H H H H
charge: 0
multiplicity: 1
keywords: wb97x-d3
keywords: def2-TZVPP
keywords: def2/J RIJCOSX
keywords: DEFGRID2
keywords: scfconv7
keywords: smallprint printgap noloewdin
keywords: NOSOSCF
formula: C19H25NO4
InChI: InChI=1/C19H25NO4/c1-11(2)9-14-15(19(14,3)4)18(23)24-10-20-16(21)12-7-5-6-8-13(12)17(20)22/h9,14-15H,5-8,10H2,1-4H3
49 atoms
O  0.306457 -1.229238 -0.03519
O  1.399271 -1.022349 1.917366
O  -1.446916 0.713228 1.762931
O  -2.993963 -2.204653 -1.355299
N  -1.974419 -1.025355 0.347897
C  2.720916 1.378317 0.356458
C  3.674846 0.240752 0.466847
C  2.277159 -0.018384 -0.067118
C  2.177448 2.009206 1.614611
C  2.872141 2.363686 -0.776537
C  4.850457 0.091001 -0.42785
C  1.318267 -0.789486 0.734212
C  5.487245 -1.06013 -0.658832
C  -0.822656 -1.837695 0.575802
C  6.690439 -1.124354 -1.548257
C  5.063943 -2.367377 -0.064295
C  -3.373001 0.805414 0.293939
C  -3.834339 -0.061335 -0.609055
C  -3.977398 2.12508 0.596784
C  -5.050024 0.132161 -1.435305
C  -4.988029 2.483291 -0.494261
C  -5.869607 1.292995 -0.86883
C  -2.162316 0.225237 0.922352
C  -2.932185 -1.238185 -0.637715
H  3.81929 -0.123801 1.480755
H  2.185023 -0.155571 -1.138447
H  2.803117 2.859867 1.890468
H  2.163138 1.331572 2.464877
H  1.164128 2.384918 1.460992
H  3.600295 3.135401 -0.518423
H  1.92136 2.861093 -0.975192
H  3.196969 1.893093 -1.704172
H  5.224703 0.99205 -0.905124
H  -0.672513 -1.982815 1.642837
H  -0.981593 -2.806605 0.108623
H  6.521973 -1.807314 -2.38471
H  7.557598 -1.509984 -1.005875
H  6.95361 -0.148555 -1.95595
H  4.162117 -2.29362 0.542548
H  5.858763 -2.781443 0.562953
H  4.879956 -3.104285 -0.851009
H  -4.461743 2.085041 1.577342
H  -3.200021 2.888478 0.674661
H  -4.756166 0.332406 -2.470486
H  -5.6405 -0.786486 -1.461498
H  -5.606153 3.316805 -0.159138
H  -4.450437 2.827507 -1.382154
H  -6.621266 1.597669 -1.597962
H  -6.411422 0.950634 0.0172
elementType: O N C H
totalener: -1094.86840630 hartree
nucrepener: 2086.04569535 hartree
electener: -3180.91410165 hartree
oneelecener: -5634.58929068 hartree
twoeener: 2453.67518904 hartree
cpcmener: -0.03777335 hartree
kineticenergy: 1090.03716907 hartree
xcener: -105.973191070585 hartree
chargesum: -0.0000000
charge: -0.287036 -0.485809 -0.440517 -0.434052 -0.095612 0.163757 -0.039900 -0.094037 -0.281584 -0.291471 -0.285354 0.405711 -0.012204 0.082010 -0.229248 -0.245363 -0.056934 -0.079459 -0.070140 -0.073722 -0.135935 -0.135304 0.335303 0.344637 0.102981 0.094497 0.100026 0.094760 0.094832 0.100642 0.099309 0.092773 0.126302 0.141160 0.125805 0.095186 0.095721 0.089714 0.079201 0.100818 0.096634 0.101177 0.094072 0.102605 0.094046 0.081248 0.078950 0.080720 0.079084
qa: -0.2870 -0.4858 -0.4405 -0.4341 -0.0956 0.1638 -0.0399 -0.0940 -0.2816 -0.2915 -0.2854 0.4057 -0.0122 0.0820 -0.2292 -0.2454 -0.0569 -0.0795 -0.0701 -0.0737 -0.1359 -0.1353 0.3353 0.3446 0.1030 0.0945 0.1000 0.0948 0.0948 0.1006 0.0993 0.0928 0.1263 0.1412 0.1258 0.0952 0.0957 0.0897 0.0792 0.1008 0.0966 0.1012 0.0941 0.1026 0.0940 0.0812 0.0790 0.0807 0.0791
va: 2.1057 2.0131 2.0666 2.0779 3.1047 3.7000 3.8434 3.8091 3.8778 3.9138 3.8833 4.1319 3.7045 3.8656 3.9279 3.9412 3.6771 3.7100 3.9169 3.9183 3.9160 3.9150 4.1865 4.1969 1.0239 1.0326 1.0026 1.0158 1.0067 0.9989 1.0024 1.0009 1.0021 1.0155 1.0157 0.9964 0.9956 1.0066 1.0155 0.9987 0.9984 1.0048 1.0150 1.0048 1.0153 1.0091 1.0066 1.0094 1.0065
dispcorr: -0.023265369 hartree
energy: -1094.891671665173
dipole: 18.15055 -19.27265 -1.12210 11.60592 -10.42490 1.18101 -6.45721 5.15212 -1.30509
magnitude: 2.08738 au
magnitude: 5.30570 debye
