program: Orca
programVersion: 5.0.2
elementType: O O O O N C C C C C C C C C C C C C C C C C C C H H H H H H H H H H H H H H H H H H H H H H H H H
charge: 0
multiplicity: 1
keywords: wb97x-d3
keywords: def2-TZVPP
keywords: def2/J RIJCOSX
keywords: DEFGRID2
keywords: scfconv7
keywords: smallprint printgap noloewdin
keywords: NOSOSCF
formula: C19H25NO4
InChI: InChI=1/C19H25NO4/c1-11(2)9-14-15(19(14,3)4)18(23)24-10-20-16(21)12-7-5-6-8-13(12)17(20)22/h9,14-15H,5-8,10H2,1-4H3
49 atoms
O  0.429189 1.182927 0.196659
O  1.608273 1.185809 -1.71488
O  -2.759935 2.290556 1.601083
O  -1.480073 -0.318603 -1.887007
N  -1.848044 1.261182 -0.252954
C  2.553969 -1.57638 -0.502239
C  3.647288 -0.566611 -0.436603
C  2.279476 -0.206329 0.111185
C  1.970821 -1.94185 -1.845046
C  2.546194 -2.726429 0.474762
C  4.80674 -0.70739 0.480685
C  1.441218 0.775984 -0.590542
C  5.590285 0.297366 0.881461
C  -0.61455 1.970074 -0.362421
C  6.762429 0.059599 1.783047
C  5.373192 1.723113 0.480259
C  -3.826162 0.391949 0.54547
C  -3.443068 -0.389455 -0.465337
C  -5.078254 0.231055 1.323284
C  -4.185983 -1.57677 -0.95314
C  -6.007202 -0.740947 0.594511
C  -5.253344 -1.962841 0.072006
C  -2.79649 1.439266 0.748708
C  -2.157985 0.128042 -0.99456
H  3.868408 -0.085768 -1.386071
H  2.168802 -0.207482 1.18945
H  0.915102 -2.205287 -1.756578
H  2.493267 -2.814211 -2.241799
H  2.061739 -1.148642 -2.5836
H  3.177221 -3.5406 0.112823
H  1.534782 -3.120103 0.588372
H  2.901388 -2.443207 1.465123
H  5.040894 -1.709928 0.826731
H  -0.417996 2.213812 -1.40361
H  -0.689854 2.894098 0.205932
H  7.691417 0.39617 1.31603
H  6.876132 -0.993003 2.041047
H  6.661162 0.626873 2.711841
H  6.244334 2.110793 -0.053665
H  5.250557 2.355042 1.363353
H  4.500465 1.865638 -0.154994
H  -4.838699 -0.136346 2.325823
H  -5.561386 1.200477 1.464979
H  -4.643234 -1.346012 -1.920229
H  -3.498558 -2.405955 -1.134291
H  -6.808589 -1.051991 1.265063
H  -6.482134 -0.224464 -0.243926
H  -5.950858 -2.670808 -0.376461
H  -4.777192 -2.478753 0.910231
elementType: O N C H
totalener: -1094.86838312 hartree
nucrepener: 2084.16002811 hartree
electener: -3179.02841123 hartree
oneelecener: -5630.78764830 hartree
twoeener: 2451.75923707 hartree
cpcmener: -0.03729008 hartree
kineticenergy: 1090.03929685 hartree
xcener: -105.973484998086 hartree
chargesum: -0.0000000
charge: -0.286796 -0.484386 -0.434138 -0.440197 -0.096815 0.162878 -0.039481 -0.093768 -0.282017 -0.292799 -0.284435 0.405003 -0.014686 0.081100 -0.229096 -0.245624 -0.081472 -0.054000 -0.075223 -0.070762 -0.133952 -0.135686 0.346040 0.335386 0.102683 0.095489 0.093975 0.100127 0.095363 0.101728 0.099414 0.092298 0.126556 0.140705 0.125953 0.095634 0.089795 0.095059 0.100594 0.097178 0.079869 0.103144 0.094621 0.101826 0.094256 0.081080 0.077894 0.081251 0.078434
qa: -0.2868 -0.4844 -0.4341 -0.4402 -0.0968 0.1629 -0.0395 -0.0938 -0.2820 -0.2928 -0.2844 0.4050 -0.0147 0.0811 -0.2291 -0.2456 -0.0815 -0.0540 -0.0752 -0.0708 -0.1340 -0.1357 0.3460 0.3354 0.1027 0.0955 0.0940 0.1001 0.0954 0.1017 0.0994 0.0923 0.1266 0.1407 0.1260 0.0956 0.0898 0.0951 0.1006 0.0972 0.0799 0.1031 0.0946 0.1018 0.0943 0.0811 0.0779 0.0813 0.0784
va: 2.1066 2.0144 2.0772 2.0663 3.1057 3.7053 3.8448 3.8154 3.8775 3.9140 3.8839 4.1299 3.7043 3.8655 3.9278 3.9412 3.7135 3.6753 3.9190 3.9171 3.9153 3.9160 4.1955 4.1849 1.0236 1.0321 1.0075 1.0027 1.0155 0.9987 1.0024 1.0010 1.0016 1.0166 1.0147 0.9958 1.0066 0.9962 0.9987 0.9983 1.0160 1.0051 1.0150 1.0048 1.0150 1.0095 1.0069 1.0091 1.0069
dispcorr: -0.023252169 hartree
energy: -1094.891635289647
dipole: 16.57359 -17.91574 -1.34215 -14.45634 13.21323 -1.24310 5.05217 -3.98027 1.07189
magnitude: 2.12029 au
magnitude: 5.38935 debye
