program: Orca
programVersion: 5.0.2
elementType: O O O O N C C C C C C C C C C C C C C C C C C C H H H H H H H H H H H H H H H H H H H H H H H H H
charge: 0
multiplicity: 1
keywords: wb97x-d3
keywords: def2-TZVPP
keywords: def2/J RIJCOSX
keywords: DEFGRID2
keywords: scfconv7
keywords: smallprint printgap noloewdin
keywords: NOSOSCF
formula: C19H25NO4
InChI: InChI=1/C19H25NO4/c1-11(2)9-14-15(19(14,3)4)18(23)24-10-20-16(21)12-7-5-6-8-13(12)17(20)22/h9,14-15H,5-8,10H2,1-4H3
49 atoms
O  0.536387 1.869131 -1.248435
O  0.595921 1.673634 0.977963
O  -1.557085 -0.041551 -2.562434
O  -2.365793 2.244099 1.285981
N  -1.738615 1.402995 -0.776099
C  3.632948 1.110052 0.626997
C  2.936073 -0.206305 0.507908
C  2.472375 0.979289 -0.341378
C  3.495437 1.881408 1.917644
C  4.987388 1.304244 -0.014013
C  3.522594 -1.376921 -0.168214
C  1.136825 1.536507 -0.094235
C  3.274474 -2.662325 0.107475
C  -0.78739 2.383597 -1.196855
C  3.953622 -3.753944 -0.663584
C  2.339272 -3.14976 1.171187
C  -2.891354 -0.587423 -0.615938
C  -3.111367 0.079651 0.517406
C  -3.457015 -1.917288 -0.947513
C  -3.941476 -0.405004 1.646261
C  -4.572399 -2.259145 0.042526
C  -4.192376 -1.904155 1.47903
C  -1.996382 0.227746 -1.471824
C  -2.384932 1.370475 0.456485
H  2.270937 -0.424202 1.336296
H  2.753873 0.938352 -1.387159
H  4.352509 1.660619 2.556535
H  2.59987 1.630848 2.480061
H  3.492977 2.957638 1.735767
H  5.770072 0.866322 0.608389
H  5.203928 2.369141 -0.115209
H  5.061464 0.862617 -1.006507
H  4.218048 -1.163661 -0.974409
H  -1.001178 2.702659 -2.213413
H  -0.85923 3.248341 -0.538333
H  4.644922 -3.364202 -1.410615
H  3.221724 -4.384056 -1.175621
H  4.51376 -4.414217 0.003618
H  1.77043 -2.359989 1.657576
H  2.889606 -3.689109 1.946742
H  1.624747 -3.861829 0.750951
H  -3.829769 -1.926777 -1.974213
H  -2.660093 -2.666636 -0.908669
H  -3.449494 -0.193718 2.598366
H  -4.886497 0.146887 1.664183
H  -5.478549 -1.713699 -0.235231
H  -4.810907 -3.320712 -0.03037
H  -3.288967 -2.452111 1.761106
H  -4.97894 -2.221574 2.164315
elementType: O N C H
totalener: -1094.86923592 hartree
nucrepener: 2126.30987132 hartree
electener: -3221.17910724 hartree
oneelecener: -5715.35907444 hartree
twoeener: 2494.17996720 hartree
cpcmener: -0.04084872 hartree
kineticenergy: 1090.04318239 hartree
xcener: -105.975608080493 hartree
chargesum: -0.0000000
charge: -0.289629 -0.493420 -0.435569 -0.429214 -0.107549 0.117372 0.019368 -0.104023 -0.278723 -0.282852 -0.275345 0.434495 -0.044488 0.087306 -0.219717 -0.255476 -0.076712 -0.060993 -0.070855 -0.078215 -0.139024 -0.133041 0.334335 0.334364 0.105493 0.090980 0.095756 0.091140 0.099626 0.099834 0.097410 0.092606 0.120455 0.145603 0.134260 0.088874 0.094728 0.093127 0.091172 0.099559 0.094412 0.094141 0.102868 0.093388 0.102272 0.078766 0.081341 0.078850 0.080942
qa: -0.2896 -0.4934 -0.4356 -0.4292 -0.1075 0.1174 0.0194 -0.1040 -0.2787 -0.2829 -0.2753 0.4345 -0.0445 0.0873 -0.2197 -0.2555 -0.0767 -0.0610 -0.0709 -0.0782 -0.1390 -0.1330 0.3343 0.3344 0.1055 0.0910 0.0958 0.0911 0.0996 0.0998 0.0974 0.0926 0.1205 0.1456 0.1343 0.0889 0.0947 0.0931 0.0912 0.0996 0.0944 0.0941 0.1029 0.0934 0.1023 0.0788 0.0813 0.0789 0.0809
va: 2.1121 2.0140 2.0741 2.0794 3.0881 3.6825 3.8034 3.8167 3.8951 3.9164 3.8885 4.1277 3.7573 3.8885 3.9195 3.9379 3.7031 3.6602 3.9156 3.9176 3.9183 3.9147 4.1900 4.1840 1.0197 1.0353 0.9994 1.0206 0.9997 1.0002 1.0012 1.0064 1.0107 0.9939 1.0151 1.0086 0.9965 0.9955 1.0114 0.9959 0.9973 1.0150 1.0048 1.0157 1.0043 1.0063 1.0091 1.0069 1.0094
dispcorr: -0.022883709 hartree
energy: -1094.892119624971
dipole: 17.67348 -17.91350 -0.24002 -19.56354 18.03057 -1.53297 8.03289 -8.19947 -0.16658
magnitude: 1.56056 au
magnitude: 3.96664 debye
