program: Orca
programVersion: 5.0.2
elementType: O O O O N C C C C C C C C C C C C C C C C C C C H H H H H H H H H H H H H H H H H H H H H H H H H
charge: 0
multiplicity: 1
keywords: wb97x-d3
keywords: def2-TZVPP
keywords: def2/J RIJCOSX
keywords: DEFGRID2
keywords: scfconv7
keywords: smallprint printgap noloewdin
keywords: NOSOSCF
formula: C19H25NO4
InChI: InChI=1/C19H25NO4/c1-11(2)9-14-15(19(14,3)4)18(23)24-10-20-16(21)12-7-5-6-8-13(12)17(20)22/h9,14-15H,5-8,10H2,1-4H3
49 atoms
O  0.498815 1.650836 -1.278648
O  0.600704 1.425476 0.944412
O  -2.357523 2.157882 1.302925
O  -1.753892 -0.102426 -2.597354
N  -1.79412 1.300325 -0.770755
C  3.669362 1.115766 0.418548
C  3.068349 -0.247285 0.554295
C  2.452062 0.747983 -0.416735
C  3.550269 2.071662 1.579998
C  4.958539 1.291317 -0.347902
C  3.717143 -1.458422 0.016512
C  1.116582 1.296467 -0.141083
C  3.87095 -2.626495 0.649469
C  -0.796013 2.231658 -1.193076
C  4.566185 -3.773115 -0.020918
C  3.400697 -2.917241 2.041517
C  -3.324568 0.106903 0.469638
C  -3.151671 -0.559168 -0.672655
C  -4.245552 -0.293482 1.560478
C  -3.831742 -1.8263 -1.032938
C  -5.199513 -1.375241 1.050639
C  -4.472859 -2.429836 0.217799
C  -2.458356 1.310525 0.452034
C  -2.170096 0.180916 -1.501063
H  2.492717 -0.383024 1.46348
H  2.659966 0.5754 -1.466588
H  3.476498 3.104556 1.233687
H  4.446501 1.997608 2.199369
H  2.69725 1.867008 2.222374
H  5.811757 1.03582 0.283575
H  5.076294 2.331171 -0.657429
H  5.011621 0.674967 -1.244213
H  4.108116 -1.379517 -0.993782
H  -1.011052 2.578368 -2.200699
H  -0.808056 3.08837 -0.520108
H  4.887825 -3.527177 -1.033031
H  3.913159 -4.64818 -0.076881
H  5.44721 -4.083158 0.547198
H  4.247494 -3.171094 2.684366
H  2.73956 -3.787601 2.048155
H  2.867592 -2.09337 2.511056
H  -3.660314 -0.660483 2.409647
H  -4.798403 0.573739 1.928803
H  -4.588291 -1.625387 -1.798289
H  -3.122241 -2.523795 -1.484638
H  -5.702283 -1.845759 1.896336
H  -5.979296 -0.909618 0.441548
H  -5.165182 -3.220528 -0.072822
H  -3.6961 -2.899779 0.827475
elementType: O N C H
totalener: -1094.87010954 hartree
nucrepener: 2097.43093491 hartree
electener: -3192.30104445 hartree
oneelecener: -5657.66936227 hartree
twoeener: 2465.36831782 hartree
cpcmener: -0.04086116 hartree
kineticenergy: 1090.03494159 hartree
xcener: -105.974083607989 hartree
chargesum: 0.0000000
charge: -0.288658 -0.493024 -0.430701 -0.436585 -0.101242 0.106385 0.047050 -0.122155 -0.278243 -0.271120 -0.285203 0.443122 -0.049474 0.084088 -0.217976 -0.251642 -0.067373 -0.082239 -0.073835 -0.074215 -0.136105 -0.134637 0.341112 0.337611 0.096596 0.089156 0.100090 0.096043 0.092192 0.098179 0.098384 0.090061 0.122405 0.147242 0.134708 0.088819 0.093477 0.094113 0.097169 0.095779 0.089549 0.102833 0.094103 0.101844 0.093648 0.080882 0.078344 0.080742 0.078702
qa: -0.2887 -0.4930 -0.4307 -0.4366 -0.1012 0.1064 0.0470 -0.1222 -0.2782 -0.2711 -0.2852 0.4431 -0.0495 0.0841 -0.2180 -0.2516 -0.0674 -0.0822 -0.0738 -0.0742 -0.1361 -0.1346 0.3411 0.3376 0.0966 0.0892 0.1001 0.0960 0.0922 0.0982 0.0984 0.0901 0.1224 0.1472 0.1347 0.0888 0.0935 0.0941 0.0972 0.0958 0.0895 0.1028 0.0941 0.1018 0.0936 0.0809 0.0783 0.0807 0.0787
va: 2.1138 2.0138 2.0783 2.0738 3.0878 3.6816 3.7651 3.8493 3.9021 3.9132 3.8731 4.1202 3.7621 3.8839 3.9187 3.9407 3.6647 3.7048 3.9177 3.9198 3.9168 3.9154 4.1869 4.1891 1.0293 1.0371 0.9993 0.9999 1.0196 1.0015 1.0016 1.0062 1.0099 0.9940 1.0154 1.0087 0.9965 0.9958 0.9968 0.9969 1.0106 1.0045 1.0157 1.0044 1.0154 1.0091 1.0066 1.0093 1.0067
dispcorr: -0.022512812 hartree
energy: -1094.892622347684
dipole: 19.63048 -19.93195 -0.30147 -17.34549 16.08740 -1.25809 9.10820 -9.27913 -0.17093
magnitude: 1.30495 au
magnitude: 3.31692 debye
