program: Orca
programVersion: 5.0.2
elementType: O O O O N C C C C C C C C C C C C C C C C C C C H H H H H H H H H H H H H H H H H H H H H H H H H
charge: 0
multiplicity: 1
keywords: wb97x-d3
keywords: def2-TZVPP
keywords: def2/J RIJCOSX
keywords: DEFGRID2
keywords: scfconv7
keywords: smallprint printgap noloewdin
keywords: NOSOSCF
formula: C19H25NO4
InChI: InChI=1/C19H25NO4/c1-11(2)9-14-15(19(14,3)4)18(23)24-10-20-16(21)12-7-5-6-8-13(12)17(20)22/h9,14-15H,5-8,10H2,1-4H3
49 atoms
O  0.515555 1.664236 -1.281304
O  0.585933 1.527594 0.949998
O  -2.385273 2.228144 1.228648
O  -1.684551 -0.156807 -2.579461
N  -1.782305 1.312686 -0.808397
C  3.653733 1.140612 0.517578
C  3.046236 -0.224227 0.590582
C  2.459876 0.810756 -0.36238
C  3.512498 2.047888 1.71465
C  4.958142 1.349421 -0.213769
C  3.701669 -1.415247 0.0200
C  1.118106 1.358103 -0.121405
C  3.733133 -2.644824 0.545146
C  -0.784016 2.23768 -1.24381
C  4.461128 -3.753546 -0.154724
C  3.081806 -3.048208 1.832048
C  -3.283105 0.11881 0.467386
C  -3.077926 -0.586113 -0.645599
C  -4.201396 -0.266984 1.56552
C  -3.707882 -1.890982 -0.95792
C  -5.115048 -1.397585 1.089781
C  -4.345245 -2.46185 0.310159
C  -2.454774 1.347432 0.409382
C  -2.115088 0.152814 -1.496218
H  2.447247 -0.389699 1.479351
H  2.699439 0.665436 -1.409288
H  4.398402 1.946749 2.344293
H  2.649623 1.817215 2.333644
H  3.444854 3.094357 1.411481
H  5.030477 0.771554 -1.133402
H  5.8010 1.073454 0.422144
H  5.074525 2.401391 -0.478878
H  4.213856 -1.264453 -0.925622
H  -0.980197 2.544619 -2.267767
H  -0.817475 3.118608 -0.603981
H  4.928216 -3.420262 -1.081298
H  3.783645 -4.577495 -0.393911
H  5.241745 -4.173098 0.485059
H  2.55524 -2.239615 2.333494
H  3.824512 -3.44226 2.529442
H  2.365804 -3.855122 1.660205
H  -3.613431 -0.581497 2.433261
H  -4.784812 0.59597 1.89398
H  -4.457905 -1.754375 -1.742929
H  -2.965617 -2.580769 -1.366102
H  -5.613543 -1.848735 1.948223
H  -5.900848 -0.981584 0.453507
H  -5.00782 -3.286451 0.046085
H  -3.561422 -2.879608 0.947901
elementType: O N C H
totalener: -1094.86988093 hartree
nucrepener: 2103.25309650 hartree
electener: -3198.12297743 hartree
oneelecener: -5669.27902329 hartree
twoeener: 2471.15604586 hartree
cpcmener: -0.04092156 hartree
kineticenergy: 1090.05558205 hartree
xcener: -105.978039036660 hartree
chargesum: -0.0000000
charge: -0.288831 -0.492274 -0.430233 -0.435825 -0.103455 0.106364 0.038385 -0.113318 -0.277785 -0.274614 -0.280167 0.441479 -0.051433 0.084913 -0.218295 -0.251618 -0.066864 -0.079013 -0.073855 -0.073906 -0.135730 -0.136522 0.339561 0.335135 0.100746 0.088638 0.096021 0.091618 0.099935 0.090599 0.098179 0.098005 0.121056 0.146232 0.134691 0.089244 0.093965 0.093453 0.089433 0.096392 0.096916 0.102946 0.094132 0.101980 0.093801 0.080868 0.078607 0.081179 0.079267
qa: -0.2888 -0.4923 -0.4302 -0.4358 -0.1035 0.1064 0.0384 -0.1133 -0.2778 -0.2746 -0.2802 0.4415 -0.0514 0.0849 -0.2183 -0.2516 -0.0669 -0.0790 -0.0739 -0.0739 -0.1357 -0.1365 0.3396 0.3351 0.1007 0.0886 0.0960 0.0916 0.0999 0.0906 0.0982 0.0980 0.1211 0.1462 0.1347 0.0892 0.0940 0.0935 0.0894 0.0964 0.0969 0.1029 0.0941 0.1020 0.0938 0.0809 0.0786 0.0812 0.0793
va: 2.1117 2.0154 2.0787 2.0746 3.0887 3.6812 3.7835 3.8273 3.9002 3.9147 3.8791 4.1222 3.7619 3.8872 3.9182 3.9393 3.6628 3.7029 3.9173 3.9189 3.9160 3.9155 4.1871 4.1896 1.0246 1.0371 0.9998 1.0203 0.9995 1.0069 1.0014 1.0012 1.0106 0.9942 1.0149 1.0087 0.9964 0.9962 1.0114 0.9970 0.9966 1.0045 1.0158 1.0047 1.0152 1.0092 1.0066 1.0092 1.0067
dispcorr: -0.022535101 hartree
energy: -1094.892416029941
dipole: 19.11917 -19.39037 -0.27120 -17.80056 16.44992 -1.35064 9.19789 -9.34040 -0.14251
magnitude: 1.38494 au
magnitude: 3.52025 debye
