program: Orca
programVersion: 5.0.2
elementType: O O O O N C C C C C C C C C C C C C C C C C C C H H H H H H H H H H H H H H H H H H H H H H H H H
charge: 0
multiplicity: 1
keywords: wb97x-d3
keywords: def2-TZVPP
keywords: def2/J RIJCOSX
keywords: DEFGRID2
keywords: scfconv7
keywords: smallprint printgap noloewdin
keywords: NOSOSCF
formula: C19H25NO4
InChI: InChI=1/C19H25NO4/c1-11(2)9-14-15(19(14,3)4)18(23)24-10-20-16(21)12-7-5-6-8-13(12)17(20)22/h9,14-15H,5-8,10H2,1-4H3
49 atoms
O  0.510915 1.873933 -1.120089
O  0.639302 1.531535 1.08733
O  -1.642729 0.110068 -2.515841
O  -2.359711 2.167279 1.475102
N  -1.765545 1.43491 -0.63512
C  3.682449 1.048665 0.538774
C  2.998681 -0.279083 0.461913
C  2.456614 0.897451 -0.343619
C  3.616637 1.813858 1.838084
C  4.983966 1.263939 -0.196189
C  3.548059 -1.430753 -0.277754
C  1.139624 1.455191 -0.010134
C  3.536491 -2.710017 0.111022
C  -0.795137 2.418747 -0.999948
C  4.103133 -3.780485 -0.773109
C  2.975845 -3.209373 1.407107
C  -3.003187 -0.50924 -0.608607
C  -3.211442 0.0979 0.560302
C  -3.601724 -1.803609 -1.015597
C  -4.100035 -0.402119 1.63711
C  -4.192768 -2.496928 0.213102
C  -4.981847 -1.526873 1.090761
C  -2.072814 0.322809 -1.409098
C  -2.419055 1.351487 0.590205
H  2.405976 -0.517418 1.338533
H  2.668398 0.866141 -1.406162
H  3.596435 2.890795 1.660905
H  4.509954 1.596286 2.426521
H  2.755946 1.555382 2.450035
H  5.00239 0.795166 -1.178714
H  5.817933 0.862035 0.382551
H  5.164824 2.330699 -0.338852
H  3.987356 -1.205149 -1.245168
H  -1.019657 2.821011 -1.984368
H  -0.829816 3.231468 -0.275241
H  4.91805 -4.311697 -0.274926
H  4.484336 -3.380829 -1.712483
H  3.345236 -4.532112 -1.009247
H  3.728079 -3.790741 1.946014
H  2.136519 -3.886277 1.227948
H  2.630632 -2.421484 2.073296
H  -4.374908 -1.624089 -1.769216
H  -2.850643 -2.434396 -1.496547
H  -3.488372 -0.758649 2.471879
H  -4.708053 0.412653 2.036897
H  -4.83354 -3.319688 -0.10546
H  -3.382424 -2.938104 0.800022
H  -5.443012 -2.063367 1.920682
H  -5.7972 -1.093139 0.505419
elementType: O N C H
totalener: -1094.86969835 hartree
nucrepener: 2110.96461195 hartree
electener: -3205.83431030 hartree
oneelecener: -5684.68666959 hartree
twoeener: 2478.85235929 hartree
cpcmener: -0.04088429 hartree
kineticenergy: 1090.04051120 hartree
xcener: -105.974781161297 hartree
chargesum: 0.0000000
charge: -0.288224 -0.492209 -0.435290 -0.430742 -0.104611 0.109083 0.042878 -0.113159 -0.278377 -0.271303 -0.283652 0.435717 -0.049948 0.086489 -0.217183 -0.253362 -0.078458 -0.066125 -0.074027 -0.074172 -0.135185 -0.136553 0.334307 0.338660 0.099964 0.088583 0.100014 0.095806 0.091504 0.090028 0.097885 0.097512 0.121502 0.146433 0.133750 0.093802 0.088614 0.093490 0.095481 0.098441 0.089905 0.101960 0.093927 0.102739 0.094665 0.080940 0.078887 0.081010 0.078604
qa: -0.2882 -0.4922 -0.4353 -0.4307 -0.1046 0.1091 0.0429 -0.1132 -0.2784 -0.2713 -0.2837 0.4357 -0.0499 0.0865 -0.2172 -0.2534 -0.0785 -0.0661 -0.0740 -0.0742 -0.1352 -0.1366 0.3343 0.3387 0.1000 0.0886 0.1000 0.0958 0.0915 0.0900 0.0979 0.0975 0.1215 0.1464 0.1338 0.0938 0.0886 0.0935 0.0955 0.0984 0.0899 0.1020 0.0939 0.1027 0.0947 0.0809 0.0789 0.0810 0.0786
va: 2.1121 2.0152 2.0747 2.0785 3.0883 3.6821 3.7745 3.8376 3.8995 3.9137 3.8781 4.1221 3.7606 3.8865 3.9188 3.9405 3.7030 3.6667 3.9190 3.9165 3.9153 3.9174 4.1889 4.1870 1.0268 1.0381 0.9994 0.9998 1.0200 1.0060 1.0014 1.0016 1.0108 0.9936 1.0157 0.9965 1.0089 0.9960 0.9972 0.9963 1.0104 1.0044 1.0154 1.0046 1.0155 1.0093 1.0068 1.0091 1.0064
dispcorr: -0.022648190 hartree
energy: -1094.892346541907
dipole: 18.66711 -18.96842 -0.30131 -19.53842 18.11063 -1.42779 6.75013 -7.02546 -0.27533
magnitude: 1.48499 au
magnitude: 3.77454 debye
