program: Orca
programVersion: 5.0.2
elementType: O O O O N C C C C C C C C C C C C C C C C C C C H H H H H H H H H H H H H H H H H H H H H H H H H
charge: 0
multiplicity: 1
keywords: wb97x-d3
keywords: def2-TZVPP
keywords: def2/J RIJCOSX
keywords: DEFGRID2
keywords: scfconv7
keywords: smallprint printgap noloewdin
keywords: NOSOSCF
formula: C19H25NO4
InChI: InChI=1/C19H25NO4/c1-11(2)9-14-15(19(14,3)4)18(23)24-10-20-16(21)12-7-5-6-8-13(12)17(20)22/h9,14-15H,5-8,10H2,1-4H3
49 atoms
O  0.307832 1.345695 0.116572
O  1.493416 1.114644 -1.775947
O  -2.828826 2.504656 1.454887
O  -1.604007 -0.341547 -1.863358
N  -1.96276 1.362748 -0.355372
C  2.515627 -1.436443 -0.261589
C  3.57288 -0.376288 -0.216417
C  2.158348 -0.035616 0.213776
C  2.048907 -1.928224 -1.610209
C  2.472627 -2.511966 0.796149
C  4.645859 -0.365185 0.795959
C  1.323974 0.850756 -0.609493
C  5.929159 -0.044154 0.599533
C  -0.733476 2.06392 -0.532164
C  6.908944 -0.094923 1.733501
C  6.521707 0.376671 -0.710431
C  -3.891609 0.516707 0.576636
C  -3.524253 -0.332082 -0.384656
C  -5.112314 0.390078 1.408223
C  -4.257202 -1.565292 -0.759085
C  -6.046281 -0.646855 0.782743
C  -5.288425 -1.891276 0.322827
C  -2.878475 1.594918 0.665658
C  -2.267308 0.165616 -0.992474
H  3.840526 0.013808 -1.192374
H  1.987022 0.047658 1.281118
H  2.586018 -2.843672 -1.864919
H  2.225953 -1.217609 -2.413918
H  0.983287 -2.166735 -1.59528
H  2.708063 -2.141326 1.792667
H  3.179535 -3.309203 0.558799
H  1.476913 -2.956494 0.839857
H  4.351705 -0.650292 1.801817
H  -0.530932 2.197546 -1.592001
H  -0.815676 3.042156 -0.064508
H  7.725709 -0.787652 1.514463
H  6.442855 -0.408776 2.667146
H  7.370647 0.88201 1.897566
H  5.795835 0.475155 -1.514106
H  7.27854 -0.341097 -1.035451
H  7.034629 1.335104 -0.606167
H  -4.829799 0.096879 2.424245
H  -5.608969 1.358582 1.501126
H  -4.744275 -1.416069 -1.727755
H  -3.559417 -2.394295 -0.896613
H  -6.818095 -0.92251 1.501819
H  -6.558886 -0.198486 -0.072627
H  -5.987877 -2.638168 -0.053858
H  -4.779389 -2.340771 1.179752
elementType: O N C H
totalener: -1094.87010754 hartree
nucrepener: 2068.90853563 hartree
electener: -3163.77864317 hartree
oneelecener: -5600.21968942 hartree
twoeener: 2436.44104625 hartree
cpcmener: -0.03880792 hartree
kineticenergy: 1090.04972725 hartree
xcener: -105.976442264110 hartree
chargesum: -0.0000000
charge: -0.284772 -0.480876 -0.434327 -0.439563 -0.100994 0.107001 0.028534 -0.085197 -0.278595 -0.273630 -0.278666 0.406732 -0.053093 0.083896 -0.217411 -0.251580 -0.076813 -0.054596 -0.074382 -0.070551 -0.134480 -0.135387 0.345023 0.334795 0.097037 0.092163 0.099729 0.093208 0.094388 0.089961 0.098178 0.098088 0.119964 0.139796 0.126241 0.093078 0.088921 0.093889 0.089835 0.098243 0.094658 0.102847 0.094425 0.101468 0.094056 0.081069 0.078420 0.080696 0.078574
qa: -0.2848 -0.4809 -0.4343 -0.4396 -0.1010 0.1070 0.0285 -0.0852 -0.2786 -0.2736 -0.2787 0.4067 -0.0531 0.0839 -0.2174 -0.2516 -0.0768 -0.0546 -0.0744 -0.0706 -0.1345 -0.1354 0.3450 0.3348 0.0970 0.0922 0.0997 0.0932 0.0944 0.0900 0.0982 0.0981 0.1200 0.1398 0.1262 0.0931 0.0889 0.0939 0.0898 0.0982 0.0947 0.1028 0.0944 0.1015 0.0941 0.0811 0.0784 0.0807 0.0786
va: 2.1094 2.0249 2.0767 2.0663 3.1080 3.6792 3.7955 3.8072 3.8988 3.9128 3.8765 4.1603 3.7661 3.8659 3.9191 3.9396 3.7089 3.6709 3.9181 3.9165 3.9151 3.9162 4.1960 4.1866 1.0256 1.0352 1.0013 1.0170 1.0058 1.0069 1.0011 1.0011 1.0112 1.0172 1.0135 0.9958 1.0088 0.9967 1.0110 0.9965 0.9971 1.0050 1.0151 1.0047 1.0151 1.0095 1.0067 1.0092 1.0066
dispcorr: -0.022520063 hartree
energy: -1094.892627606738
dipole: 19.38178 -20.64448 -1.26270 -17.01569 15.70319 -1.31250 4.87174 -3.75913 1.11261
magnitude: 2.13423 au
magnitude: 5.42479 debye
