program: Orca
programVersion: 5.0.2
elementType: O O O O N C C C C C C C C C C C C C C C C C C C H H H H H H H H H H H H H H H H H H H H H H H H H
charge: 0
multiplicity: 1
keywords: wb97x-d3
keywords: def2-TZVPP
keywords: def2/J RIJCOSX
keywords: DEFGRID2
keywords: scfconv7
keywords: smallprint printgap noloewdin
keywords: NOSOSCF
formula: C19H25NO4
InChI: InChI=1/C19H25NO4/c1-11(2)9-14-15(19(14,3)4)18(23)24-10-20-16(21)12-7-5-6-8-13(12)17(20)22/h9,14-15H,5-8,10H2,1-4H3
49 atoms
O  0.448218 1.747347 -0.226568
O  1.53206 1.697884 1.7412
O  -2.951316 2.095585 -1.560174
O  -1.041132 -0.257456 1.82385
N  -1.780558 1.239308 0.236165
C  4.038028 1.197993 -0.088986
C  3.560048 -0.089495 0.481814
C  2.56839 0.817596 -0.226083
C  4.465437 2.306869 0.839628
C  4.817566 1.176692 -1.38161
C  3.916289 -1.401893 -0.117468
C  1.503727 1.457699 0.557289
C  3.080528 -2.432939 -0.264994
C  -0.752779 2.222275 0.365201
C  3.535473 -3.721939 -0.877627
C  1.640345 -2.396941 0.14607
C  -3.52697 -0.034831 -0.562009
C  -2.967589 -0.725855 0.432817
C  -4.706509 -0.473695 -1.346657
C  -3.437724 -2.042064 0.929851
C  -4.966522 -1.95905 -1.087527
C  -4.846081 -2.309872 0.395719
C  -2.769565 1.228345 -0.742634
C  -1.817881 0.05025 0.953475
H  3.452898 -0.086617 1.564276
H  2.268749 0.511222 -1.221671
H  5.54262 2.243099 1.007187
H  3.983653 2.263261 1.813818
H  4.260697 3.286534 0.402485
H  4.481123 0.393555 -2.060541
H  5.878905 1.013989 -1.184772
H  4.721006 2.130878 -1.902269
H  4.947515 -1.521546 -0.439226
H  -1.057783 3.116034 -0.1734
H  -0.611255 2.476698 1.412612
H  3.424813 -4.550344 -0.173447
H  4.578073 -3.682591 -1.192428
H  2.927486 -3.975313 -1.749795
H  0.987094 -2.41171 -0.731202
H  1.381588 -1.523103 0.740148
H  1.387493 -3.284568 0.730932
H  -5.574573 0.127054 -1.055031
H  -4.550439 -0.282191 -2.411227
H  -2.742763 -2.821084 0.59851
H  -3.419588 -2.066356 2.022211
H  -5.957586 -2.224521 -1.456608
H  -4.247982 -2.554471 -1.657911
H  -5.105041 -3.356806 0.555818
H  -5.565448 -1.716794 0.967619
elementType: O N C H
totalener: -1094.86819621 hartree
nucrepener: 2119.12522690 hartree
electener: -3213.99342311 hartree
oneelecener: -5700.68830704 hartree
twoeener: 2486.69488393 hartree
cpcmener: -0.03844993 hartree
kineticenergy: 1090.02547022 hartree
xcener: -105.971267829307 hartree
chargesum: -0.0000000
charge: -0.287736 -0.486382 -0.434688 -0.440575 -0.092067 0.151388 -0.001000 -0.122530 -0.283172 -0.283826 -0.310366 0.412550 -0.008784 0.078081 -0.229771 -0.233622 -0.079191 -0.051462 -0.070014 -0.074783 -0.136225 -0.133590 0.343059 0.331536 0.103939 0.096749 0.095644 0.092111 0.100903 0.094039 0.099557 0.098632 0.124388 0.126763 0.141330 0.097426 0.089691 0.094844 0.103250 0.070399 0.102915 0.101729 0.093575 0.101991 0.094283 0.080970 0.078623 0.080998 0.078422
qa: -0.2877 -0.4864 -0.4347 -0.4406 -0.0921 0.1514 -0.0010 -0.1225 -0.2832 -0.2838 -0.3104 0.4125 -0.0088 0.0781 -0.2298 -0.2336 -0.0792 -0.0515 -0.0700 -0.0748 -0.1362 -0.1336 0.3431 0.3315 0.1039 0.0967 0.0956 0.0921 0.1009 0.0940 0.0996 0.0986 0.1244 0.1268 0.1413 0.0974 0.0897 0.0948 0.1032 0.0704 0.1029 0.1017 0.0936 0.1020 0.0943 0.0810 0.0786 0.0810 0.0784
va: 2.1032 2.0144 2.0774 2.0635 3.1054 3.6912 3.8015 3.8109 3.8957 3.9082 3.8972 4.1307 3.7155 3.8654 3.9311 3.9392 3.7104 3.6799 3.9152 3.9229 3.9184 3.9154 4.1938 4.1756 1.0257 1.0308 1.0009 1.0176 0.9987 1.0017 0.9999 1.0028 1.0035 1.0155 1.0150 0.9961 1.0061 0.9962 0.9976 1.0125 1.0013 1.0045 1.0154 1.0048 1.0151 1.0091 1.0066 1.0096 1.0067
dispcorr: -0.024166921 hartree
energy: -1094.892363130173
dipole: 14.51166 -15.63366 -1.12200 -17.09659 15.55467 -1.54193 -5.71569 4.53192 -1.18377
magnitude: 2.24449 au
magnitude: 5.70503 debye
