program: Orca
programVersion: 5.0.2
elementType: O O O O N C C C C C C C C C C C C C C C C C C C H H H H H H H H H H H H H H H H H H H H H H H H H
charge: 0
multiplicity: 1
keywords: wb97x-d3
keywords: def2-TZVPP
keywords: def2/J RIJCOSX
keywords: DEFGRID2
keywords: scfconv7
keywords: smallprint printgap noloewdin
keywords: NOSOSCF
formula: C19H25NO4
InChI: InChI=1/C19H25NO4/c1-11(2)9-14-15(19(14,3)4)18(23)24-10-20-16(21)12-7-5-6-8-13(12)17(20)22/h9,14-15H,5-8,10H2,1-4H3
49 atoms
O  0.594286 0.869862 -0.702154
O  1.916309 2.341652 -1.72664
O  -2.203888 -0.687429 -2.147601
O  -1.682748 2.157907 1.354647
N  -1.699407 0.964424 -0.617215
C  3.056837 0.601331 1.195228
C  2.836976 -0.618034 0.366818
C  2.918376 0.731399 -0.317304
C  1.956096 1.072831 2.113484
C  4.437277 0.890727 1.732862
C  3.909692 -1.622232 0.137215
C  1.785292 1.395482 -0.97927
C  4.095001 -2.295732 -1.000851
C  -0.553217 1.534772 -1.230432
C  5.189665 -3.308121 -1.141435
C  3.249622 -2.099634 -2.221382
C  -3.447431 -0.437419 -0.086039
C  -3.284247 0.385608 0.951112
C  -4.49811 -1.478305 -0.192616
C  -4.103846 0.37674 2.186239
C  -5.557661 -1.240576 0.885023
C  -4.930945 -0.909087 2.23839
C  -2.413107 -0.126787 -1.101649
C  -2.150727 1.293498 0.656419
H  1.832998 -1.029308 0.433181
H  3.850702 0.945276 -0.827923
H  2.118155 0.662372 3.111927
H  0.964651 0.758205 1.796172
H  1.955595 2.160553 2.203874
H  5.226946 0.590467 1.044442
H  4.600667 0.366983 2.676858
H  4.554562 1.958646 1.924794
H  4.569569 -1.831059 0.974973
H  -0.613942 1.395233 -2.308911
H  -0.518525 2.600976 -1.011283
H  4.780634 -4.299897 -1.350219
H  5.80388 -3.378274 -0.243993
H  5.843505 -3.061703 -1.981834
H  2.392932 -1.449302 -2.053872
H  2.875088 -3.058787 -2.586898
H  3.842232 -1.672204 -3.034767
H  -4.944817 -1.464502 -1.189328
H  -4.042103 -2.466769 -0.079076
H  -3.463418 0.466146 3.066583
H  -4.753533 1.257411 2.194004
H  -6.205646 -0.416114 0.575117
H  -6.192885 -2.122521 0.972193
H  -4.288756 -1.736821 2.551596
H  -5.708108 -0.81135 2.996943
elementType: O N C H
totalener: -1094.86779973 hartree
nucrepener: 2104.34164436 hartree
electener: -3199.20944409 hartree
oneelecener: -5670.40924243 hartree
twoeener: 2471.19979834 hartree
cpcmener: -0.03737241 hartree
kineticenergy: 1090.04639236 hartree
xcener: -105.973952129387 hartree
chargesum: -0.0000000
charge: -0.272514 -0.498310 -0.434744 -0.436640 -0.104988 0.151740 0.025481 -0.126649 -0.277136 -0.289585 -0.324192 0.424968 -0.008246 0.068484 -0.230116 -0.241925 -0.082362 -0.038139 -0.071892 -0.071032 -0.136084 -0.135280 0.345839 0.314693 0.107596 0.096397 0.097511 0.079780 0.104760 0.093781 0.098844 0.098844 0.123787 0.135653 0.134917 0.097066 0.089983 0.094503 0.079667 0.100270 0.101519 0.094250 0.103024 0.094495 0.102337 0.078816 0.081001 0.078773 0.081054
qa: -0.2725 -0.4983 -0.4347 -0.4366 -0.1050 0.1517 0.0255 -0.1266 -0.2771 -0.2896 -0.3242 0.4250 -0.0082 0.0685 -0.2301 -0.2419 -0.0824 -0.0381 -0.0719 -0.0710 -0.1361 -0.1353 0.3458 0.3147 0.1076 0.0964 0.0975 0.0798 0.1048 0.0938 0.0988 0.0988 0.1238 0.1357 0.1349 0.0971 0.0900 0.0945 0.0797 0.1003 0.1015 0.0943 0.1030 0.0945 0.1023 0.0788 0.0810 0.0788 0.0811
va: 2.0891 1.9975 2.0745 2.0662 3.1377 3.6877 3.7777 3.8652 3.9050 3.9123 3.8934 4.0783 3.6962 3.8954 3.9309 3.9342 3.7214 3.6909 3.9172 3.9168 3.9178 3.9161 4.1728 4.1674 1.0178 1.0279 1.0028 1.0102 0.9990 1.0018 0.9999 1.0021 1.0029 1.0046 1.0035 0.9961 1.0060 0.9964 1.0167 1.0001 0.9979 1.0150 1.0049 1.0150 1.0046 1.0065 1.0095 1.0066 1.0094
dispcorr: -0.023906465 hartree
energy: -1094.891706191843
dipole: 13.64406 -15.13961 -1.49555 -14.76169 13.08543 -1.67626 9.18779 -7.72811 1.45968
magnitude: 2.67903 au
magnitude: 6.80955 debye
