program: Orca
programVersion: 5.0.2
elementType: O O O O N C C C C C C C C C C C C C C C C C C C H H H H H H H H H H H H H H H H H H H H H H H H H
charge: 0
multiplicity: 1
keywords: wb97x-d3
keywords: def2-TZVPP
keywords: def2/J RIJCOSX
keywords: DEFGRID2
keywords: scfconv7
keywords: smallprint printgap noloewdin
keywords: NOSOSCF
formula: C19H25NO4
InChI: InChI=1/C19H25NO4/c1-11(2)9-14-15(19(14,3)4)18(23)24-10-20-16(21)12-7-5-6-8-13(12)17(20)22/h9,14-15H,5-8,10H2,1-4H3
49 atoms
O  0.598399 1.277714 -1.550657
O  0.401738 -0.917086 -1.165894
O  -1.43799 2.697829 0.207036
O  -2.458274 -1.016481 -2.210573
N  -1.734955 0.98875 -1.311499
C  2.156488 0.242465 1.297292
C  2.826284 -0.853386 0.533796
C  2.231212 0.305411 -0.223308
C  0.838309 -0.040917 1.976493
C  2.998075 1.258793 2.027275
C  4.298251 -1.060547 0.557782
C  1.008166 0.117583 -1.01862
C  5.016765 -1.513939 -0.472616
C  -0.663867 1.309148 -2.204737
C  6.494986 -1.729107 -0.362833
C  4.423282 -1.841758 -1.808006
C  -2.925098 0.841363 0.659116
C  -3.216502 -0.249152 -0.050844
C  -3.487566 1.165581 1.992096
C  -4.145026 -1.323319 0.374605
C  -4.697897 0.270715 2.263853
C  -4.434748 -1.181795 1.869788
C  -1.956895 1.65644 -0.111962
C  -2.454506 -0.204458 -1.32082
H  2.240829 -1.767403 0.464888
H  2.914069 1.052861 -0.613009
H  0.24724 -0.801702 1.468467
H  0.232947 0.865126 2.05105
H  1.01685 -0.397742 2.992552
H  2.452926 2.198064 2.135271
H  3.9323 1.477008 1.509953
H  3.245386 0.904794 3.030075
H  4.808549 -0.855504 1.494852
H  -0.69853 0.626889 -3.053557
H  -0.762526 2.327136 -2.571226
H  7.032181 -1.134648 -1.106285
H  6.754545 -2.772693 -0.557484
H  6.877836 -1.464368 0.622518
H  4.672399 -2.865518 -2.097755
H  4.840333 -1.194329 -2.584024
H  3.339776 -1.742287 -1.83596
H  -2.713986 1.014673 2.752101
H  -3.761662 2.221469 2.045096
H  -5.068955 -1.251169 -0.207845
H  -3.721276 -2.304484 0.148865
H  -4.965608 0.329559 3.319228
H  -5.555851 0.647277 1.700123
H  -5.291057 -1.802717 2.13485
H  -3.58196 -1.562603 2.438505
elementType: O N C H
totalener: -1094.86698148 hartree
nucrepener: 2163.96512134 hartree
electener: -3258.83210281 hartree
oneelecener: -5790.53889102 hartree
twoeener: 2531.70678821 hartree
cpcmener: -0.03842640 hartree
kineticenergy: 1090.05233786 hartree
xcener: -105.976083614197 hartree
chargesum: -0.0000000
charge: -0.281486 -0.479010 -0.433147 -0.427255 -0.105057 0.173082 -0.019279 -0.131853 -0.281819 -0.292554 -0.301379 0.413765 -0.019335 0.086093 -0.230196 -0.237487 -0.101457 -0.026504 -0.063096 -0.075471 -0.139135 -0.132757 0.324600 0.315790 0.104915 0.102211 0.090771 0.091059 0.106945 0.099121 0.094179 0.099997 0.125620 0.135556 0.145348 0.094754 0.096272 0.090260 0.099990 0.099412 0.076524 0.102226 0.094588 0.101928 0.093314 0.081122 0.079171 0.080846 0.078818
qa: -0.2815 -0.4790 -0.4331 -0.4273 -0.1051 0.1731 -0.0193 -0.1319 -0.2818 -0.2926 -0.3014 0.4138 -0.0193 0.0861 -0.2302 -0.2375 -0.1015 -0.0265 -0.0631 -0.0755 -0.1391 -0.1328 0.3246 0.3158 0.1049 0.1022 0.0908 0.0911 0.1069 0.0991 0.0942 0.1000 0.1256 0.1356 0.1453 0.0948 0.0963 0.0903 0.1000 0.0994 0.0765 0.1022 0.0946 0.1019 0.0933 0.0811 0.0792 0.0808 0.0788
va: 2.1149 2.0152 2.0670 2.0806 3.0809 3.7057 3.8290 3.8108 3.8888 3.9018 3.8869 4.1528 3.7122 3.8914 3.9300 3.9314 3.7103 3.6160 3.9100 3.9134 3.9222 3.9145 4.1566 4.1903 1.0240 1.0279 1.0120 1.0083 1.0021 1.0030 1.0013 0.9994 1.0022 1.0134 0.9926 0.9963 0.9961 1.0059 1.0001 0.9984 1.0216 1.0061 1.0164 1.0037 1.0160 1.0093 1.0061 1.0094 1.0074
dispcorr: -0.026013433 hartree
energy: -1094.892994909892
dipole: 17.30834 -17.64838 -0.34004 -8.00446 8.31194 0.30747 15.08001 -13.75856 1.32145
magnitude: 1.39871 au
magnitude: 3.55523 debye
