program: Orca
programVersion: 5.0.2
elementType: O O O O N C C C C C C C C C C C C C C C C C C C H H H H H H H H H H H H H H H H H H H H H H H H H
charge: 0
multiplicity: 1
keywords: wb97x-d3
keywords: def2-TZVPP
keywords: def2/J RIJCOSX
keywords: DEFGRID2
keywords: scfconv7
keywords: smallprint printgap noloewdin
keywords: NOSOSCF
formula: C19H25NO4
InChI: InChI=1/C19H25NO4/c1-11(2)9-14-15(19(14,3)4)18(23)24-10-20-16(21)12-7-5-6-8-13(12)17(20)22/h9,14-15H,5-8,10H2,1-4H3
49 atoms
O  0.624451 0.872806 -1.289009
O  1.394785 2.938133 -0.883962
O  -1.616808 2.363634 0.601602
O  -2.170275 -1.034886 -2.355615
N  -1.698322 0.880151 -1.159335
C  2.360806 0.320335 1.278145
C  2.861781 -0.380796 0.048486
C  2.589825 1.106432 -0.003652
C  0.959551 0.019152 1.752283
C  3.31287 0.618267 2.411014
C  4.25996 -0.844257 -0.082791
C  1.492452 1.739519 -0.756848
C  4.659431 -2.08278 -0.388288
C  -0.572022 1.354133 -1.892295
C  6.117157 -2.408677 -0.515759
C  3.739238 -3.239159 -0.634205
C  -3.124364 0.467427 0.603532
C  -3.280995 -0.535092 -0.262967
C  -3.887676 0.632053 1.86379
C  -4.23045 -1.662588 -0.10212
C  -5.104694 -0.294459 1.843767
C  -4.750387 -1.69115 1.336202
C  -2.078244 1.377888 0.082145
C  -2.349558 -0.326398 -1.397247
H  2.116931 -1.002945 -0.434831
H  3.464143 1.748186 0.029738
H  0.301141 -0.332557 0.960167
H  0.503428 0.897227 2.213622
H  0.994947 -0.764507 2.511462
H  4.306951 0.90014 2.06628
H  3.41921 -0.254875 3.05786
H  2.932808 1.438004 3.023417
H  5.027445 -0.092987 0.080567
H  -0.616605 0.95907 -2.904092
H  -0.590965 2.439891 -1.938554
H  6.749614 -1.535498 -0.357401
H  6.342261 -2.812495 -1.506357
H  6.413285 -3.176457 0.203461
H  4.023502 -4.088037 -0.009547
H  3.816179 -3.581947 -1.667745
H  2.693862 -3.019744 -0.432408
H  -3.236878 0.399344 2.712504
H  -4.190319 1.67361 1.99128
H  -5.055617 -1.539591 -0.810522
H  -3.747333 -2.606871 -0.362759
H  -5.531404 -0.357016 2.845371
H  -5.87509 0.139427 1.200332
H  -5.622376 -2.343319 1.395082
H  -3.986682 -2.128074 1.985322
elementType: O N C H
totalener: -1094.86838900 hartree
nucrepener: 2124.78235766 hartree
electener: -3219.65074666 hartree
oneelecener: -5711.35170721 hartree
twoeener: 2491.70096055 hartree
cpcmener: -0.04117114 hartree
kineticenergy: 1090.04256164 hartree
xcener: -105.974943113590 hartree
chargesum: 0.0000000
charge: -0.274772 -0.481527 -0.429451 -0.433425 -0.085258 0.119601 0.079279 -0.149950 -0.279927 -0.270953 -0.311964 0.436779 -0.035608 0.063401 -0.223107 -0.256347 -0.012648 -0.079473 -0.073471 -0.066542 -0.133929 -0.137893 0.264416 0.347316 0.099019 0.093817 0.081599 0.099825 0.101638 0.089379 0.096306 0.099443 0.121615 0.128414 0.140159 0.088716 0.093503 0.094526 0.094703 0.098923 0.090558 0.102673 0.095159 0.101656 0.093505 0.080968 0.078768 0.081078 0.079505
qa: -0.2748 -0.4815 -0.4295 -0.4334 -0.0853 0.1196 0.0793 -0.1500 -0.2799 -0.2710 -0.3120 0.4368 -0.0356 0.0634 -0.2231 -0.2563 -0.0126 -0.0795 -0.0735 -0.0665 -0.1339 -0.1379 0.2644 0.3473 0.0990 0.0938 0.0816 0.0998 0.1016 0.0894 0.0963 0.0994 0.1216 0.1284 0.1402 0.0887 0.0935 0.0945 0.0947 0.0989 0.0906 0.1027 0.0952 0.1017 0.0935 0.0810 0.0788 0.0811 0.0795
va: 2.1095 2.0189 2.0713 2.0768 3.1024 3.6942 3.7158 3.8687 3.9085 3.9055 3.8631 4.1529 3.7421 3.8817 3.9232 3.9442 3.6061 3.7199 3.9175 3.9158 3.9161 3.9189 4.2065 4.1738 1.0243 1.0342 1.0115 1.0055 1.0025 1.0050 1.0024 1.0014 1.0096 1.0125 1.0186 1.0086 0.9954 0.9964 0.9978 0.9963 1.0090 1.0053 1.0153 1.0046 1.0158 1.0094 1.0065 1.0093 1.0065
dispcorr: -0.024505356 hartree
energy: -1094.892894351251
dipole: 13.82275 -15.06379 -1.24104 -18.16272 16.02529 -2.13743 14.86680 -13.65406 1.21274
magnitude: 2.75310 au
magnitude: 6.99782 debye
