program: Orca
programVersion: 5.0.2
elementType: O O O O N C C C C C C C C C C C C C C C C C C C H H H H H H H H H H H H H H H H H H H H H H H H H
charge: 0
multiplicity: 1
keywords: wb97x-d3
keywords: def2-TZVPP
keywords: def2/J RIJCOSX
keywords: DEFGRID2
keywords: scfconv7
keywords: smallprint printgap noloewdin
keywords: NOSOSCF
formula: C19H25NO4
InChI: InChI=1/C19H25NO4/c1-11(2)9-14-15(19(14,3)4)18(23)24-10-20-16(21)12-7-5-6-8-13(12)17(20)22/h9,14-15H,5-8,10H2,1-4H3
49 atoms
O  0.344902 0.624802 0.455593
O  1.850476 1.074569 2.039389
O  -2.55323 2.494073 0.053372
O  -1.883144 -1.884169 1.064849
N  -1.918357 0.404743 0.79451
C  3.7699 1.520881 -0.414236
C  3.983181 0.157312 0.139708
C  2.567176 0.612298 -0.202983
C  4.007666 2.715615 0.47659
C  4.105305 1.790461 -1.86135
C  4.619594 -0.946001 -0.616944
C  1.599804 0.8036 0.88574
C  4.579492 -2.223075 -0.227203
C  -0.691675 0.732457 1.430173
C  5.297791 -3.298646 -0.980138
C  3.834001 -2.656753 1.003179
C  -3.86781 0.516745 -0.426349
C  -3.673766 -0.768352 -0.125839
C  -5.019558 1.049442 -1.192924
C  -4.587638 -1.877813 -0.4900
C  -5.760923 -0.104572 -1.869968
C  -5.932734 -1.30216 -0.936658
C  -2.744258 1.306572 0.132693
C  -2.409661 -0.88698 0.63917
H  4.165972 0.135802 1.211224
H  2.141129 0.205057 -1.112363
H  3.352017 3.545429 0.207301
H  5.036705 3.057838 0.352318
H  3.865779 2.499243 1.532666
H  3.54292 2.651844 -2.225608
H  3.872429 0.948367 -2.512483
H  5.167112 2.017337 -1.974766
H  5.172948 -0.688245 -1.514837
H  -0.74963 1.746879 1.822944
H  -0.519518 0.042661 2.25539
H  4.600784 -4.061616 -1.33566
H  6.013493 -3.813999 -0.334064
H  5.840912 -2.907211 -1.840072
H  2.885834 -2.129429 1.121151
H  4.418389 -2.468593 1.908219
H  3.620261 -3.725782 0.981654
H  -5.683607 1.59176 -0.512629
H  -4.68015 1.781064 -1.929663
H  -4.134344 -2.471866 -1.289688
H  -4.714956 -2.557105 0.355777
H  -6.735411 0.242816 -2.214515
H  -5.205913 -0.415487 -2.75927
H  -6.515739 -2.080048 -1.430552
H  -6.501742 -0.995162 -0.054926
elementType: O N C H
totalener: -1094.86927480 hartree
nucrepener: 2049.25980745 hartree
electener: -3144.12908225 hartree
oneelecener: -5560.68257156 hartree
twoeener: 2416.55348931 hartree
cpcmener: -0.03619788 hartree
kineticenergy: 1090.03447606 hartree
xcener: -105.971089781219 hartree
chargesum: -0.0000000
charge: -0.283978 -0.501753 -0.433798 -0.435180 -0.111879 0.149233 -0.040886 -0.068766 -0.273773 -0.291045 -0.281457 0.410099 -0.007102 0.086788 -0.222736 -0.282113 -0.073509 -0.069930 -0.069293 -0.071959 -0.135086 -0.135360 0.339458 0.343407 0.100763 0.092328 0.100641 0.096322 0.091476 0.100378 0.090049 0.101889 0.128214 0.133649 0.130996 0.095010 0.099288 0.087031 0.095416 0.107859 0.098174 0.102049 0.093746 0.102939 0.093566 0.080244 0.078867 0.081251 0.078470
qa: -0.2840 -0.5018 -0.4338 -0.4352 -0.1119 0.1492 -0.0409 -0.0688 -0.2738 -0.2910 -0.2815 0.4101 -0.0071 0.0868 -0.2227 -0.2821 -0.0735 -0.0699 -0.0693 -0.0720 -0.1351 -0.1354 0.3395 0.3434 0.1008 0.0923 0.1006 0.0963 0.0915 0.1004 0.0900 0.1019 0.1282 0.1336 0.1310 0.0950 0.0993 0.0870 0.0954 0.1079 0.0982 0.1020 0.0937 0.1029 0.0936 0.0802 0.0789 0.0813 0.0785
va: 2.1040 1.9964 2.0774 2.0752 3.1354 3.7396 3.8246 3.8506 3.8810 3.9178 3.8580 4.0892 3.6920 3.8871 3.9243 3.9524 3.6963 3.6905 3.9188 3.9202 3.9178 3.9166 4.1868 4.1821 1.0220 1.0300 0.9993 1.0008 1.0182 1.0019 1.0014 0.9988 1.0027 1.0028 1.0023 0.9949 0.9932 1.0083 0.9999 0.9959 1.0043 1.0043 1.0150 1.0046 1.0151 1.0094 1.0064 1.0095 1.0067
dispcorr: -0.022129962 hartree
energy: -1094.891404764837
dipole: 17.09549 -18.49659 -1.40109 -7.35275 6.58633 -0.76642 -10.66811 9.08925 -1.57885
magnitude: 2.24572 au
magnitude: 5.70816 debye
