program: Orca
programVersion: 5.0.2
elementType: O O O O N C C C C C C C C C C C C C C C C C C C H H H H H H H H H H H H H H H H H H H H H H H H H
charge: 0
multiplicity: 1
keywords: wb97x-d3
keywords: def2-TZVPP
keywords: def2/J RIJCOSX
keywords: DEFGRID2
keywords: scfconv7
keywords: smallprint printgap noloewdin
keywords: NOSOSCF
formula: C19H25NO4
InChI: InChI=1/C19H25NO4/c1-11(2)9-14-15(19(14,3)4)18(23)24-10-20-16(21)12-7-5-6-8-13(12)17(20)22/h9,14-15H,5-8,10H2,1-4H3
49 atoms
O  0.196525 0.528623 0.459565
O  1.724863 0.846982 2.053387
O  -2.56829 2.552635 -0.049937
O  -2.200253 -1.811709 1.15741
N  -2.079046 0.459818 0.786154
C  3.630504 1.217068 -0.432066
C  3.810004 -0.157263 0.136312
C  2.412521 0.341519 -0.189744
C  3.921186 2.403661 0.453455
C  3.966479 1.472021 -1.881365
C  4.374707 -1.278225 -0.639979
C  1.457557 0.60087 0.89856
C  5.333884 -2.100576 -0.204605
C  -0.838599 0.730722 1.421313
C  5.850026 -3.211324 -1.066438
C  5.962086 -1.975723 1.159107
C  -4.007582 0.647128 -0.458447
C  -3.905238 -0.63237 -0.095385
C  -5.113385 1.219183 -1.263605
C  -4.892888 -1.69204 -0.412723
C  -5.924681 0.085566 -1.893418
C  -6.190347 -1.046434 -0.901999
C  -2.838015 1.384647 0.077636
C  -2.656238 -0.80146 0.684154
H  4.039133 -0.166457 1.19733
H  1.961168 -0.061765 -1.08942
H  3.77813 2.198119 1.511899
H  3.295677 3.257268 0.184986
H  4.961809 2.706279 0.320658
H  5.037829 1.645166 -1.999849
H  3.446284 2.361968 -2.240028
H  3.689221 0.645449 -2.533983
H  3.972418 -1.434915 -1.636371
H  -0.833118 1.759009 1.780936
H  -0.716448 0.058395 2.269399
H  5.714716 -4.181006 -0.579975
H  6.923955 -3.103695 -1.240132
H  5.352679 -3.247097 -2.03551
H  6.762523 -2.702937 1.292375
H  5.23854 -2.144687 1.959354
H  6.392946 -0.986782 1.323976
H  -5.745775 1.836946 -0.618352
H  -4.718226 1.889545 -2.030237
H  -4.477897 -2.357291 -1.176378
H  -5.073957 -2.316201 0.465188
H  -6.868063 0.480507 -2.27171
H  -5.380685 -0.30904 -2.756006
H  -6.824866 -1.805458 -1.360584
H  -6.741595 -0.653011 -0.043509
elementType: O N C H
totalener: -1094.87015021 hartree
nucrepener: 2025.90330007 hartree
electener: -3120.77345028 hartree
oneelecener: -5513.93060531 hartree
twoeener: 2393.15715503 hartree
cpcmener: -0.03710990 hartree
kineticenergy: 1090.03077098 hartree
xcener: -105.970912895888 hartree
chargesum: -0.0000000
charge: -0.279878 -0.498994 -0.434071 -0.433732 -0.111942 0.107416 0.052384 -0.106768 -0.278469 -0.268549 -0.308599 0.424909 -0.012962 0.086821 -0.221257 -0.284020 -0.072870 -0.071851 -0.069239 -0.071161 -0.134044 -0.136085 0.339841 0.342475 0.092817 0.090051 0.091427 0.100136 0.096986 0.097489 0.098750 0.089353 0.122525 0.136364 0.129358 0.097800 0.097076 0.085665 0.095793 0.103207 0.105063 0.101112 0.094325 0.102796 0.093656 0.080319 0.078461 0.081420 0.078696
qa: -0.2799 -0.4990 -0.4341 -0.4337 -0.1119 0.1074 0.0524 -0.1068 -0.2785 -0.2685 -0.3086 0.4249 -0.0130 0.0868 -0.2213 -0.2840 -0.0729 -0.0719 -0.0692 -0.0712 -0.1340 -0.1361 0.3398 0.3425 0.0928 0.0901 0.0914 0.1001 0.0970 0.0975 0.0988 0.0894 0.1225 0.1364 0.1294 0.0978 0.0971 0.0857 0.0958 0.1032 0.1051 0.1011 0.0943 0.1028 0.0937 0.0803 0.0785 0.0814 0.0787
va: 2.1126 1.9995 2.0773 2.0779 3.1360 3.6966 3.7544 3.8984 3.9043 3.9133 3.8925 4.1052 3.6905 3.8839 3.9189 3.9398 3.6954 3.6849 3.9196 3.9200 3.9170 3.9162 4.1874 4.1863 1.0272 1.0348 1.0187 0.9994 1.0001 1.0018 1.0019 1.0057 1.0085 1.0017 1.0034 0.9929 0.9929 1.0101 1.0047 0.9967 0.9953 1.0046 1.0150 1.0046 1.0150 1.0093 1.0067 1.0094 1.0068
dispcorr: -0.021516033 hartree
energy: -1094.891666239354
dipole: 21.63049 -22.92660 -1.29611 -6.19291 5.68742 -0.50549 -10.70358 9.11868 -1.58490
magnitude: 2.10887 au
magnitude: 5.36033 debye
