program: Orca
programVersion: 5.0.2
elementType: O O O O N C C C C C C C C C C C C C C C C C C C H H H H H H H H H H H H H H H H H H H H H H H H H
charge: 0
multiplicity: 1
keywords: wb97x-d3
keywords: def2-TZVPP
keywords: def2/J RIJCOSX
keywords: DEFGRID2
keywords: scfconv7
keywords: smallprint printgap noloewdin
keywords: NOSOSCF
formula: C19H25NO4
InChI: InChI=1/C19H25NO4/c1-11(2)9-14-15(19(14,3)4)18(23)24-10-20-16(21)12-7-5-6-8-13(12)17(20)22/h9,14-15H,5-8,10H2,1-4H3
49 atoms
O  0.191623 0.721831 0.412954
O  1.729735 1.036904 1.998949
O  -2.6890 2.60347 -0.2376
O  -2.0569 -1.613889 1.327123
N  -2.077985 0.623069 0.774701
C  3.668774 1.171969 -0.470397
C  3.758285 -0.189942 0.146319
C  2.396943 0.381212 -0.209149
C  4.021944 2.368712 0.377457
C  4.035761 1.351416 -1.923258
C  4.252505 -1.370266 -0.591373
C  1.452229 0.747528 0.856765
C  5.212114 -2.19314 -0.158595
C  -0.841087 1.006236 1.357003
C  5.640386 -3.376648 -0.970266
C  5.919522 -2.003606 1.157098
C  -4.012172 0.588634 -0.47512
C  -3.8321 -0.648304 -0.008726
C  -5.148722 1.022726 -1.323057
C  -4.748814 -1.790895 -0.239731
C  -5.880175 -0.208321 -1.860951
C  -6.081223 -1.270251 -0.78056
C  -2.888924 1.437228 -0.008315
C  -2.575613 -0.675598 0.776367
H  3.981768 -0.178658 1.208565
H  1.929912 -0.028119 -1.098068
H  5.075965 2.612792 0.234524
H  3.870327 2.204113 1.441398
H  3.440988 3.244419 0.082515
H  3.707061 0.523086 -2.549211
H  5.117952 1.443406 -2.032941
H  3.58507 2.262898 -2.319597
H  3.790691 -1.574433 -1.552885
H  -0.863292 2.0704 1.588065
H  -0.689905 0.447347 2.279181
H  5.075324 -3.466503 -1.897721
H  5.514983 -4.304811 -0.406341
H  6.701803 -3.313816 -1.223718
H  6.293764 -0.987126 1.283061
H  6.771374 -2.676889 1.247033
H  5.2609 -2.208226 2.004005
H  -5.824117 1.645914 -0.728653
H  -4.793454 1.655519 -2.139321
H  -4.287519 -2.486429 -0.947782
H  -4.894917 -2.353639 0.684823
H  -6.842837 0.0921 -2.275042
H  -5.303045 -0.636191 -2.685001
H  -6.664661 -2.102364 -1.175621
H  -6.660663 -0.843571 0.042658
elementType: O N C H
totalener: -1094.86995854 hartree
nucrepener: 2028.76736297 hartree
electener: -3123.63732151 hartree
oneelecener: -5519.66418294 hartree
twoeener: 2396.02686143 hartree
cpcmener: -0.03707601 hartree
kineticenergy: 1090.03928024 hartree
xcener: -105.972489120575 hartree
chargesum: -0.0000000
charge: -0.279907 -0.498860 -0.433481 -0.434025 -0.112709 0.117738 0.052490 -0.116349 -0.283240 -0.266963 -0.312293 0.425944 -0.011401 0.088415 -0.220958 -0.284592 -0.073073 -0.069595 -0.071755 -0.070397 -0.133992 -0.136913 0.339509 0.341223 0.094625 0.090183 0.096629 0.092302 0.100774 0.089867 0.097147 0.098037 0.122825 0.137911 0.127809 0.085793 0.098447 0.096279 0.103552 0.095841 0.105282 0.101171 0.094492 0.102896 0.093654 0.080668 0.078366 0.081790 0.078843
qa: -0.2799 -0.4989 -0.4335 -0.4340 -0.1127 0.1177 0.0525 -0.1163 -0.2832 -0.2670 -0.3123 0.4259 -0.0114 0.0884 -0.2210 -0.2846 -0.0731 -0.0696 -0.0718 -0.0704 -0.1340 -0.1369 0.3395 0.3412 0.0946 0.0902 0.0966 0.0923 0.1008 0.0899 0.0971 0.0980 0.1228 0.1379 0.1278 0.0858 0.0984 0.0963 0.1036 0.0958 0.1053 0.1012 0.0945 0.1029 0.0937 0.0807 0.0784 0.0818 0.0788
va: 2.1127 1.9993 2.0772 2.0765 3.1378 3.6835 3.7497 3.9080 3.9046 3.9123 3.8907 4.1044 3.6907 3.8794 3.9198 3.9406 3.6979 3.6812 3.9195 3.9200 3.9167 3.9161 4.1889 4.1875 1.0259 1.0355 1.0002 1.0189 0.9990 1.0050 1.0021 1.0022 1.0081 1.0025 1.0051 1.0100 0.9929 0.9933 0.9957 1.0045 0.9958 1.0045 1.0151 1.0048 1.0150 1.0094 1.0068 1.0094 1.0068
dispcorr: -0.021581025 hartree
energy: -1094.891539566171
dipole: 21.69890 -22.96896 -1.27007 -8.34745 7.63668 -0.71077 -10.46062 8.91210 -1.54852
magnitude: 2.12513 au
magnitude: 5.40165 debye
