program: Orca
programVersion: 5.0.2
elementType: O O O O N C C C C C C C C C C C C C C C C C C C H H H H H H H H H H H H H H H H H H H H H H H H H
charge: 0
multiplicity: 1
keywords: wb97x-d3
keywords: def2-TZVPP
keywords: def2/J RIJCOSX
keywords: DEFGRID2
keywords: scfconv7
keywords: smallprint printgap noloewdin
keywords: NOSOSCF
formula: C19H25NO4
InChI: InChI=1/C19H25NO4/c1-11(2)9-14-15(19(14,3)4)18(23)24-10-20-16(21)12-7-5-6-8-13(12)17(20)22/h9,14-15H,5-8,10H2,1-4H3
49 atoms
O  0.245409 1.105951 -0.655998
O  1.466892 2.059259 0.964043
O  -1.794628 0.184639 1.703227
O  -2.876586 1.547584 -2.492557
N  -2.053614 1.139659 -0.374806
C  3.794293 0.573027 -0.567646
C  3.448222 -0.153413 0.692882
C  2.344258 0.206293 -0.272666
C  4.272305 2.000058 -0.475936
C  4.440925 -0.198911 -1.690641
C  3.793566 -1.582216 0.905444
C  1.345614 1.220254 0.102065
C  4.907413 -2.00442 1.50939
C  -0.875644 1.939497 -0.382189
C  5.182253 -3.462706 1.712534
C  5.961393 -1.077124 2.031421
C  -3.667827 -0.372636 0.269012
C  -3.983153 0.030819 -0.962722
C  -4.46381 -1.319422 1.087185
C  -5.174924 -0.41021 -1.726757
C  -5.8575 -1.469712 0.474933
C  -5.800765 -1.627873 -1.04389
C  -2.413173 0.303366 0.674896
C  -2.949768 0.989901 -1.426346
H  3.482531 0.469521 1.582569
H  1.954026 -0.603343 -0.879756
H  4.009011 2.562984 -1.373573
H  5.360932 2.010829 -0.391305
H  3.876818 2.532372 0.38616
H  4.046157 -1.210012 -1.787176
H  5.517405 -0.278514 -1.523264
H  4.290336 0.310483 -2.644156
H  3.085742 -2.32225 0.543521
H  -0.959188 2.688976 -1.166891
H  -0.770811 2.444678 0.575399
H  4.381656 -4.09111 1.32289
H  5.307124 -3.6939 2.773577
H  6.11355 -3.756917 1.222063
H  5.77567 -0.032371 1.787369
H  6.940908 -1.344515 1.627786
H  6.045438 -1.158126 3.118457
H  -3.950173 -2.285086 1.126009
H  -4.526418 -0.969134 2.119871
H  -5.891444 0.415733 -1.778159
H  -4.902988 -0.63809 -2.759863
H  -6.361005 -2.328064 0.920993
H  -6.455638 -0.589257 0.725411
H  -6.804009 -1.789992 -1.439614
H  -5.217943 -2.51885 -1.292974
elementType: O N C H
totalener: -1094.86883036 hartree
nucrepener: 2041.93625602 hartree
electener: -3136.80508638 hartree
oneelecener: -5546.17804164 hartree
twoeener: 2409.37295526 hartree
cpcmener: -0.03767300 hartree
kineticenergy: 1090.03619304 hartree
xcener: -105.972411099255 hartree
chargesum: -0.0000000
charge: -0.284607 -0.488081 -0.437930 -0.434944 -0.097664 0.127225 -0.010509 -0.133451 -0.295257 -0.271019 -0.253253 0.441306 -0.043116 0.079105 -0.228975 -0.249294 -0.057201 -0.082804 -0.073790 -0.069887 -0.134324 -0.136138 0.339545 0.342714 0.099465 0.097615 0.103080 0.097207 0.094413 0.093503 0.097482 0.100983 0.123833 0.128891 0.139001 0.090423 0.094903 0.094966 0.087036 0.095950 0.103125 0.102640 0.092962 0.101807 0.094209 0.081021 0.078272 0.081306 0.078255
qa: -0.2846 -0.4881 -0.4379 -0.4349 -0.0977 0.1272 -0.0105 -0.1335 -0.2953 -0.2710 -0.2533 0.4413 -0.0431 0.0791 -0.2290 -0.2493 -0.0572 -0.0828 -0.0738 -0.0699 -0.1343 -0.1361 0.3395 0.3427 0.0995 0.0976 0.1031 0.0972 0.0944 0.0935 0.0975 0.1010 0.1238 0.1289 0.1390 0.0904 0.0949 0.0950 0.0870 0.0960 0.1031 0.1026 0.0930 0.1018 0.0942 0.0810 0.0783 0.0813 0.0783
va: 2.1075 2.0184 2.0722 2.0762 3.1119 3.6782 3.7941 3.8649 3.8996 3.9071 3.8566 4.1469 3.7072 3.8501 3.9271 3.9378 3.6764 3.7162 3.9217 3.9181 3.9151 3.9188 4.1908 4.1972 1.0250 1.0352 0.9999 1.0003 1.0173 1.0021 1.0008 1.0032 1.0063 1.0108 1.0174 1.0072 0.9951 0.9964 1.0076 0.9981 0.9983 1.0045 1.0153 1.0045 1.0151 1.0095 1.0068 1.0094 1.0065
dispcorr: -0.022437585 hartree
energy: -1094.891267944231
dipole: 22.77818 -23.75785 -0.97966 -15.16332 13.59436 -1.56896 2.55591 -3.15891 -0.60300
magnitude: 1.94550 au
magnitude: 4.94507 debye
