program: Orca
programVersion: 5.0.2
elementType: O O O O N C C C C C C C C C C C C C C C C C C C H H H H H H H H H H H H H H H H H H H H H H H H H
charge: 0
multiplicity: 1
keywords: wb97x-d3
keywords: def2-TZVPP
keywords: def2/J RIJCOSX
keywords: DEFGRID2
keywords: scfconv7
keywords: smallprint printgap noloewdin
keywords: NOSOSCF
formula: C19H25NO4
InChI: InChI=1/C19H25NO4/c1-11(2)9-14-15(19(14,3)4)18(23)24-10-20-16(21)12-7-5-6-8-13(12)17(20)22/h9,14-15H,5-8,10H2,1-4H3
49 atoms
O  0.301804 1.389813 -0.668497
O  1.451778 1.987134 1.164159
O  -1.611821 0.261721 1.719801
O  -2.821384 1.731135 -2.402875
N  -1.986344 1.322002 -0.289799
C  3.797513 0.784195 -0.618103
C  3.478181 -0.096023 0.551622
C  2.356818 0.373414 -0.353689
C  4.248618 2.198063 -0.348922
C  4.430576 0.190842 -1.852806
C  3.810697 -1.533795 0.589801
C  1.359508 1.328768 0.155322
C  4.364109 -2.193705 1.612833
C  -0.835195 2.161936 -0.297848
C  4.625861 -3.66733 1.520207
C  4.763294 -1.575909 2.918508
C  -3.422439 -0.397231 0.250464
C  -3.777285 0.037937 -0.959762
C  -4.101786 -1.480459 1.001541
C  -4.905094 -0.495908 -1.760939
C  -5.460076 -1.768154 0.360033
C  -5.369993 -1.82568 -1.16431
C  -2.247598 0.384007 0.702424
C  -2.849144 1.123064 -1.362314
H  3.514322 0.417696 1.505983
H  1.962354 -0.355595 -1.05296
H  3.931113 2.869574 -1.148984
H  5.338978 2.230907 -0.309056
H  3.879546 2.596589 0.593885
H  4.048858 -0.800751 -2.090745
H  5.511756 0.111221 -1.724435
H  4.247552 0.829996 -2.718323
H  3.567385 -2.102821 -0.302833
H  -0.973338 2.946546 -1.038117
H  -0.70749 2.621057 0.679453
H  4.108309 -4.206898 2.317782
H  5.689937 -3.885353 1.642394
H  4.30314 -4.085238 0.566852
H  4.15549 -1.976353 3.734705
H  4.676163 -0.491242 2.940814
H  5.799642 -1.82815 3.156701
H  -3.470526 -2.374576 0.991672
H  -4.215661 -1.203121 2.051857
H  -5.720494 0.234411 -1.762946
H  -4.607081 -0.61809 -2.804677
H  -5.855047 -2.707784 0.747481
H  -6.166872 -0.986364 0.651606
H  -6.338465 -2.094587 -1.587099
H  -4.669711 -2.61332 -1.455337
elementType: O N C H
totalener: -1094.87025549 hartree
nucrepener: 2055.98698112 hartree
electener: -3150.85723661 hartree
oneelecener: -5574.37798599 hartree
twoeener: 2423.52074938 hartree
cpcmener: -0.03913575 hartree
kineticenergy: 1090.03396916 hartree
xcener: -105.972936764909 hartree
chargesum: 0.0000000
charge: -0.283438 -0.484657 -0.435938 -0.434144 -0.106879 0.103821 0.046473 -0.126861 -0.271513 -0.269133 -0.288241 0.437383 -0.044767 0.082072 -0.219527 -0.254963 -0.057425 -0.075711 -0.074027 -0.070212 -0.133719 -0.134862 0.337700 0.341194 0.089056 0.095190 0.099908 0.097579 0.090164 0.089609 0.098108 0.098126 0.121943 0.127904 0.138994 0.093122 0.094150 0.089006 0.099301 0.091160 0.094236 0.102889 0.093800 0.101824 0.093638 0.080485 0.077991 0.080829 0.078362
qa: -0.2834 -0.4847 -0.4359 -0.4341 -0.1069 0.1038 0.0465 -0.1269 -0.2715 -0.2691 -0.2882 0.4374 -0.0448 0.0821 -0.2195 -0.2550 -0.0574 -0.0757 -0.0740 -0.0702 -0.1337 -0.1349 0.3377 0.3412 0.0891 0.0952 0.0999 0.0976 0.0902 0.0896 0.0981 0.0981 0.1219 0.1279 0.1390 0.0931 0.0941 0.0890 0.0993 0.0912 0.0942 0.1029 0.0938 0.1018 0.0936 0.0805 0.0780 0.0808 0.0784
va: 2.1080 2.0245 2.0753 2.0766 3.1141 3.7044 3.7619 3.8213 3.9076 3.9091 3.8785 4.1515 3.7541 3.8587 3.9212 3.9422 3.6696 3.7053 3.9201 3.9168 3.9157 3.9176 4.1979 4.1986 1.0349 1.0355 0.9995 1.0003 1.0167 1.0057 1.0016 1.0019 1.0102 1.0116 1.0194 0.9956 0.9965 1.0086 0.9959 1.0089 0.9976 1.0046 1.0150 1.0043 1.0155 1.0095 1.0068 1.0095 1.0066
dispcorr: -0.021881868 hartree
energy: -1094.892137352837
dipole: 20.40428 -21.42212 -1.01784 -16.96691 15.36283 -1.60408 2.79929 -3.53423 -0.73495
magnitude: 2.03697 au
magnitude: 5.17756 debye
