program: Orca
programVersion: 5.0.2
elementType: O O O O N C C C C C C C C C C C C C C C C C C C H H H H H H H H H H H H H H H H H H H H H H H H H
charge: 0
multiplicity: 1
keywords: wb97x-d3
keywords: def2-TZVPP
keywords: def2/J RIJCOSX
keywords: DEFGRID2
keywords: scfconv7
keywords: smallprint printgap noloewdin
keywords: NOSOSCF
formula: C19H25NO4
InChI: InChI=1/C19H25NO4/c1-11(2)9-14-15(19(14,3)4)18(23)24-10-20-16(21)12-7-5-6-8-13(12)17(20)22/h9,14-15H,5-8,10H2,1-4H3
49 atoms
O  0.484843 -0.797375 -1.123238
O  0.431313 1.390939 -1.554893
O  -1.798823 -1.857081 0.74207
O  -2.483726 1.294638 -2.464404
N  -1.856754 -0.451074 -1.082942
C  2.45077 -0.065067 1.1182
C  3.231542 -0.538612 -0.070741
C  2.208268 0.566792 -0.244868
C  1.446832 -1.002691 1.743195
C  3.12545 0.827839 2.131221
C  4.663288 -0.205284 -0.260046
C  0.970259 0.443379 -1.029276
C  5.680743 -1.070033 -0.204847
C  -0.748577 -0.993641 -1.803794
C  7.092869 -0.61435 -0.418619
C  5.531731 -2.532513 0.081382
C  -3.302561 0.03803 0.645343
C  -3.50605 0.955876 -0.300444
C  -4.016364 -0.024813 1.943621
C  -4.50882 2.045821 -0.229745
C  -4.764672 1.288907 2.175794
C  -5.484739 1.76587 0.9148
C  -2.250154 -0.892918 0.174802
C  -2.583247 0.685241 -1.430146
H  2.92412 -1.511344 -0.440592
H  2.625658 1.562946 -0.34535
H  1.112478 -1.787973 1.070708
H  0.571103 -0.462331 2.107592
H  1.906978 -1.493421 2.603192
H  2.380497 1.361027 2.724838
H  3.776162 1.571157 1.672432
H  3.730759 0.233564 2.818738
H  4.892817 0.838968 -0.452952
H  -0.848687 -2.072191 -1.890225
H  -0.730676 -0.562643 -2.803503
H  7.707508 -0.818579 0.461936
H  7.154302 0.452345 -0.6332
H  7.556332 -1.153628 -1.248817
H  4.498324 -2.8519 0.202584
H  6.067327 -2.793952 0.997995
H  5.978947 -3.131869 -0.715408
H  -4.710477 -0.870903 1.934443
H  -3.310755 -0.221538 2.754068
H  -3.995782 3.000671 -0.078312
H  -5.038078 2.135993 -1.181085
H  -5.479457 1.162573 2.989533
H  -4.054119 2.054986 2.498184
H  -6.060697 2.666373 1.130333
H  -6.200749 1.002978 0.597269
elementType: O N C H
totalener: -1094.86730486 hartree
nucrepener: 2113.18363961 hartree
electener: -3208.05094447 hartree
oneelecener: -5688.85745509 hartree
twoeener: 2480.80651062 hartree
cpcmener: -0.04159594 hartree
kineticenergy: 1090.03577791 hartree
xcener: -105.973753141474 hartree
chargesum: -0.0000000
charge: -0.274099 -0.488288 -0.436228 -0.428570 -0.093315 0.166011 0.043907 -0.176156 -0.310879 -0.264693 -0.299760 0.450819 -0.032355 0.069961 -0.226195 -0.253311 -0.050571 -0.070642 -0.074659 -0.072545 -0.134837 -0.137660 0.312574 0.335346 0.107773 0.089558 0.085836 0.103386 0.098660 0.099281 0.091142 0.094968 0.123570 0.140592 0.136353 0.094042 0.089668 0.094374 0.089215 0.097332 0.096848 0.102648 0.095144 0.102351 0.093845 0.080782 0.078845 0.081119 0.078815
qa: -0.2741 -0.4883 -0.4362 -0.4286 -0.0933 0.1660 0.0439 -0.1762 -0.3109 -0.2647 -0.2998 0.4508 -0.0324 0.0700 -0.2262 -0.2533 -0.0506 -0.0706 -0.0747 -0.0725 -0.1348 -0.1377 0.3126 0.3353 0.1078 0.0896 0.0858 0.1034 0.0987 0.0993 0.0911 0.0950 0.1236 0.1406 0.1364 0.0940 0.0897 0.0944 0.0892 0.0973 0.0968 0.1026 0.0951 0.1024 0.0938 0.0808 0.0788 0.0811 0.0788
va: 2.1087 2.0165 2.0701 2.0790 3.0863 3.6084 3.7441 3.9225 3.9061 3.9092 3.8607 4.1401 3.7226 3.9057 3.9239 3.9451 3.7056 3.6755 3.9171 3.9130 3.9147 3.9181 4.1680 4.1843 1.0150 1.0370 1.0200 0.9989 1.0033 1.0015 1.0039 1.0030 1.0080 0.9994 1.0134 0.9961 1.0081 0.9958 1.0089 0.9970 0.9978 1.0048 1.0146 1.0047 1.0157 1.0096 1.0065 1.0093 1.0062
dispcorr: -0.024302018 hartree
energy: -1094.891606880850
dipole: 20.60374 -20.99142 -0.38768 -1.63024 1.04483 -0.58541 16.33189 -14.70247 1.62942
magnitude: 1.77426 au
magnitude: 4.50981 debye
