program: Orca
programVersion: 5.0.2
elementType: O O O O N C C C C C C C C C C C C C C C C C C C H H H H H H H H H H H H H H H H H H H H H H H H H
charge: 0
multiplicity: 1
keywords: wb97x-d3
keywords: def2-TZVPP
keywords: def2/J RIJCOSX
keywords: DEFGRID2
keywords: scfconv7
keywords: smallprint printgap noloewdin
keywords: NOSOSCF
formula: C19H25NO4
InChI: InChI=1/C19H25NO4/c1-11(2)9-14-15(19(14,3)4)18(23)24-10-20-16(21)12-7-5-6-8-13(12)17(20)22/h9,14-15H,5-8,10H2,1-4H3
49 atoms
O  0.483152 1.035386 0.49275
O  1.615656 1.582996 -1.368476
O  -2.709715 1.595091 2.171671
O  -1.434538 0.3503 -2.005856
N  -1.793947 1.262313 0.078634
C  2.715178 -1.337666 -1.015576
C  3.744717 -0.360857 -0.561728
C  2.337892 -0.250807 -0.013594
C  2.215566 -1.275402 -2.437894
C  2.731544 -2.738004 -0.453787
C  4.863847 -0.759493 0.33183
C  1.478245 0.876299 -0.398299
C  5.302032 -0.070239 1.38859
C  -0.558623 1.962313 0.220937
C  6.453171 -0.559599 2.214001
C  4.70567 1.225082 1.845685
C  -3.785743 0.193461 0.517769
C  -3.409056 -0.181216 -0.705668
C  -5.032103 -0.234912 1.196455
C  -4.178251 -1.083431 -1.595937
C  -5.640802 -1.420628 0.446281
C  -5.607269 -1.218886 -1.067776
C  -2.748434 1.094565 1.075722
C  -2.112259 0.466241 -1.014541
H  3.989982 0.400987 -1.298594
H  2.189338 -0.602752 1.000748
H  2.356988 -0.30144 -2.900754
H  1.155317 -1.52939 -2.497595
H  2.760269 -2.001758 -3.043734
H  1.739716 -3.187917 -0.524424
H  3.034337 -2.765277 0.592792
H  3.420512 -3.369815 -1.017818
H  5.375377 -1.68303 0.07318
H  -0.355637 2.542856 -0.675805
H  -0.636434 2.641439 1.066537
H  6.850673 -1.506278 1.848851
H  6.154484 -0.697127 3.256391
H  7.26738 0.169306 2.221117
H  4.291032 1.125168 2.852221
H  3.918703 1.596506 1.192786
H  5.47722 1.99645 1.907584
H  -4.830218 -0.492478 2.238468
H  -5.731199 0.60674 1.22306
H  -4.173437 -0.703542 -2.619831
H  -3.684341 -2.05936 -1.632446
H  -5.0894 -2.32927 0.702833
H  -6.66767 -1.573247 0.77993
H  -6.171236 -0.318313 -1.32539
H  -6.102613 -2.052388 -1.566751
elementType: O N C H
totalener: -1094.86823409 hartree
nucrepener: 2088.84959571 hartree
electener: -3183.71782979 hartree
oneelecener: -5640.14790880 hartree
twoeener: 2456.43007901 hartree
cpcmener: -0.03800106 hartree
kineticenergy: 1090.04450374 hartree
xcener: -105.974690377452 hartree
chargesum: 0.0000000
charge: -0.287585 -0.484943 -0.434883 -0.440083 -0.095227 0.150510 0.002224 -0.133326 -0.287596 -0.283388 -0.304959 0.419582 -0.015496 0.077416 -0.228868 -0.241847 -0.078532 -0.059469 -0.068767 -0.075242 -0.136023 -0.133780 0.342662 0.341106 0.105005 0.101459 0.093328 0.096184 0.098389 0.098669 0.093486 0.099238 0.123672 0.141630 0.125780 0.089887 0.094913 0.096658 0.100380 0.085422 0.102911 0.093194 0.101790 0.093064 0.103074 0.078403 0.080894 0.078377 0.080709
qa: -0.2876 -0.4849 -0.4349 -0.4401 -0.0952 0.1505 0.0022 -0.1333 -0.2876 -0.2834 -0.3050 0.4196 -0.0155 0.0774 -0.2289 -0.2418 -0.0785 -0.0595 -0.0688 -0.0752 -0.1360 -0.1338 0.3427 0.3411 0.1050 0.1015 0.0933 0.0962 0.0984 0.0987 0.0935 0.0992 0.1237 0.1416 0.1258 0.0899 0.0949 0.0967 0.1004 0.0854 0.1029 0.0932 0.1018 0.0931 0.1031 0.0784 0.0809 0.0784 0.0807
va: 2.1004 2.0195 2.0766 2.0662 3.1020 3.6871 3.8007 3.8320 3.8929 3.9083 3.8931 4.1142 3.7160 3.8676 3.9294 3.9328 3.7117 3.6708 3.9162 3.9193 3.9189 3.9154 4.1952 4.1860 1.0226 1.0282 1.0162 1.0046 1.0023 1.0023 1.0027 1.0002 1.0037 1.0158 1.0152 1.0062 0.9969 0.9962 0.9985 1.0105 0.9992 1.0157 1.0044 1.0156 1.0045 1.0065 1.0094 1.0067 1.0096
dispcorr: -0.023457887 hartree
energy: -1094.891691972960
dipole: 15.43672 -16.78579 -1.34907 -15.47398 14.00708 -1.46690 2.34746 -1.61242 0.73505
magnitude: 2.12417 au
magnitude: 5.39921 debye
