program: Orca
programVersion: 5.0.2
elementType: O O O O N C C C C C C C C C C C C C C C C C C C H H H H H H H H H H H H H H H H H H H H H H H H H
charge: 0
multiplicity: 1
keywords: wb97x-d3
keywords: def2-TZVPP
keywords: def2/J RIJCOSX
keywords: DEFGRID2
keywords: scfconv7
keywords: smallprint printgap noloewdin
keywords: NOSOSCF
formula: C19H25NO4
InChI: InChI=1/C19H25NO4/c1-11(2)9-14-15(19(14,3)4)18(23)24-10-20-16(21)12-7-5-6-8-13(12)17(20)22/h9,14-15H,5-8,10H2,1-4H3
49 atoms
O  0.305699 -1.218055 -0.014663
O  1.42081 -1.044004 1.925862
O  -1.471374 0.739707 1.772289
O  -2.985216 -2.196688 -1.343813
N  -1.97128 -0.996735 0.346591
C  2.729635 1.36784 0.359999
C  3.686288 0.230436 0.467369
C  2.287315 -0.029466 -0.058796
C  2.192981 1.997388 1.621988
C  2.873402 2.353088 -0.77401
C  4.860819 0.083891 -0.429811
C  1.32879 -0.799706 0.748341
C  5.50095 -1.064196 -0.666703
C  -0.828546 -1.811494 0.600957
C  6.704194 -1.119961 -1.557151
C  5.082334 -2.376089 -0.07943
C  -3.390592 0.816437 0.293648
C  -3.840601 -0.0545 -0.610421
C  -4.007556 2.131022 0.594246
C  -5.052881 0.130047 -1.443991
C  -5.015488 2.482804 -0.501311
C  -5.884437 1.286786 -0.886296
C  -2.174923 0.248421 0.926649
C  -2.929042 -1.2262 -0.634124
H  3.835541 -0.130862 1.481801
H  2.189616 -0.168664 -1.129526
H  2.833421 2.833107 1.911809
H  2.159189 1.310996 2.465134
H  1.187207 2.393903 1.468759
H  3.596824 3.131232 -0.521068
H  1.919077 2.844522 -0.972558
H  3.198617 1.884301 -1.702741
H  5.23463 0.987513 -0.902967
H  -0.685228 -1.932787 1.672746
H  -0.98981 -2.789697 0.152501
H  6.542653 -1.804961 -2.3936
H  7.576292 -1.496284 -1.015702
H  6.959863 -0.142888 -1.967127
H  4.19463 -2.306504 0.546423
H  5.885057 -2.803793 0.525872
H  4.875982 -3.102493 -0.869034
H  -4.495482 2.087526 1.573187
H  -3.236875 2.900947 0.677132
H  -4.754304 0.328354 -2.478369
H  -5.637884 -0.79224 -1.472842
H  -5.644446 3.309054 -0.166946
H  -4.47691 2.837435 -1.38452
H  -6.629793 1.587985 -1.623517
H  -6.436099 0.941804 -0.007428
elementType: O N C H
totalener: -1094.87852803 hartree
nucrepener: 2083.91745766 hartree
electener: -3178.79598570 hartree
oneelecener: -5630.22769453 hartree
twoeener: 2451.43170884 hartree
cpcmener: -0.03050931 hartree
kineticenergy: 1090.05173258 hartree
xcener: -105.972894068628 hartree
chargesum: -0.0000000
charge: -0.283140 -0.457389 -0.412896 -0.409037 -0.094690 0.159608 -0.043297 -0.091756 -0.277174 -0.291547 -0.277214 0.385774 -0.012600 0.080012 -0.228541 -0.243512 -0.059422 -0.082083 -0.070564 -0.073483 -0.136197 -0.135583 0.314594 0.323481 0.102921 0.092469 0.097928 0.095478 0.093407 0.099703 0.098399 0.091469 0.122739 0.140068 0.123937 0.093915 0.095061 0.088586 0.079531 0.099107 0.095592 0.099989 0.093492 0.101222 0.093395 0.080900 0.078420 0.080435 0.078491
qa: -0.2831 -0.4574 -0.4129 -0.4090 -0.0947 0.1596 -0.0433 -0.0918 -0.2772 -0.2915 -0.2772 0.3858 -0.0126 0.0800 -0.2285 -0.2435 -0.0594 -0.0821 -0.0706 -0.0735 -0.1362 -0.1356 0.3146 0.3235 0.1029 0.0925 0.0979 0.0955 0.0934 0.0997 0.0984 0.0915 0.1227 0.1401 0.1239 0.0939 0.0951 0.0886 0.0795 0.0991 0.0956 0.1000 0.0935 0.1012 0.0934 0.0809 0.0784 0.0804 0.0785
va: 2.1064 2.0483 2.1004 2.1098 3.0937 3.7123 3.8465 3.8024 3.8795 3.9125 3.8831 4.1630 3.7076 3.8657 3.9291 3.9414 3.6603 3.6928 3.9191 3.9201 3.9147 3.9136 4.2149 4.2260 1.0244 1.0326 1.0023 1.0168 1.0068 0.9991 1.0029 1.0012 1.0026 1.0167 1.0151 0.9965 0.9959 1.0069 1.0163 0.9991 0.9985 1.0051 1.0154 1.0051 1.0156 1.0093 1.0067 1.0097 1.0066
dispcorr: -0.023215667 hartree
energy: -1094.901743701790
dipole: 18.13500 -19.25022 -1.11522 11.51179 -10.38537 1.12643 -6.54987 5.34663 -1.20324
magnitude: 1.99006 au
magnitude: 5.05832 debye
