program: Orca
programVersion: 5.0.2
elementType: O O O O N C C C C C C C C C C C C C C C C C C C H H H H H H H H H H H H H H H H H H H H H H H H H
charge: 0
multiplicity: 1
keywords: wb97x-d3
keywords: def2-TZVPP
keywords: def2/J RIJCOSX
keywords: DEFGRID2
keywords: scfconv7
keywords: smallprint printgap noloewdin
keywords: NOSOSCF
formula: C19H25NO4
InChI: InChI=1/C19H25NO4/c1-11(2)9-14-15(19(14,3)4)18(23)24-10-20-16(21)12-7-5-6-8-13(12)17(20)22/h9,14-15H,5-8,10H2,1-4H3
49 atoms
O  0.351407 -1.131587 0.354395
O  1.465182 -0.490842 2.193907
O  -1.448773 1.224877 1.528669
O  -2.929579 -2.45804 -0.676264
N  -1.930867 -0.836545 0.626531
C  2.807653 1.436058 0.086196
C  3.74821 0.349065 0.482516
C  2.354577 -0.019293 0.02521
C  2.263545 2.364402 1.144245
C  2.986556 2.106296 -1.254559
C  4.931743 -0.001813 -0.345791
C  1.379676 -0.549543 0.992314
C  5.349622 -1.237965 -0.629741
C  -0.786533 -1.544157 1.09915
C  6.573167 -1.47232 -1.462675
C  4.660141 -2.479888 -0.156027
C  -3.379859 0.875785 0.104821
C  -3.810837 -0.207305 -0.543673
C  -4.034913 2.206183 0.074871
C  -5.011197 -0.260904 -1.413548
C  -5.444874 2.066497 -0.5027
C  -5.472559 1.162018 -1.734498
C  -2.149812 0.51591 0.852646
C  -2.88674 -1.332452 -0.252062
H  3.893857 0.256513 1.556797
H  2.261696 -0.424307 -0.976417
H  2.898253 3.250404 1.211975
H  2.230773 1.915932 2.1348
H  1.255988 2.703137 0.893859
H  3.333914 1.41806 -2.025469
H  3.710958 2.920751 -1.184962
H  2.04298 2.536145 -1.59657
H  5.5142 0.834876 -0.723169
H  -0.651482 -1.368643 2.16437
H  -0.939848 -2.608531 0.932838
H  6.334829 -2.061399 -2.352511
H  7.322943 -2.042773 -0.908139
H  7.034154 -0.540461 -1.790344
H  3.808555 -2.283733 0.492552
H  5.356969 -3.115642 0.396582
H  4.308861 -3.076318 -1.002681
H  -4.063628 2.639531 1.077337
H  -3.432927 2.890918 -0.531573
H  -4.794697 -0.817757 -2.328413
H  -5.802138 -0.819688 -0.90256
H  -6.107534 1.654841 0.263923
H  -5.83547 3.053434 -0.754723
H  -4.823688 1.583469 -2.507743
H  -6.479132 1.132516 -2.154254
elementType: O N C H
totalener: -1094.87849903 hartree
nucrepener: 2087.09271000 hartree
electener: -3181.97120903 hartree
oneelecener: -5636.54775139 hartree
twoeener: 2454.57654236 hartree
cpcmener: -0.03027104 hartree
kineticenergy: 1090.03648556 hartree
xcener: -105.970181541255 hartree
chargesum: 0.0000000
charge: -0.283299 -0.455874 -0.413441 -0.409183 -0.093828 0.147940 -0.001984 -0.130884 -0.284058 -0.283541 -0.297831 0.395073 -0.015295 0.078605 -0.227799 -0.239467 -0.059297 -0.084054 -0.073286 -0.069540 -0.134104 -0.136367 0.317923 0.322245 0.103689 0.099820 0.097032 0.095465 0.093505 0.093067 0.098698 0.097926 0.120605 0.140650 0.123821 0.093674 0.095674 0.088965 0.084550 0.101099 0.098439 0.093339 0.100979 0.092793 0.100141 0.078029 0.080903 0.078114 0.080371
qa: -0.2833 -0.4559 -0.4134 -0.4092 -0.0938 0.1479 -0.0020 -0.1309 -0.2841 -0.2835 -0.2978 0.3951 -0.0153 0.0786 -0.2278 -0.2395 -0.0593 -0.0841 -0.0733 -0.0695 -0.1341 -0.1364 0.3179 0.3222 0.1037 0.0998 0.0970 0.0955 0.0935 0.0931 0.0987 0.0979 0.1206 0.1407 0.1238 0.0937 0.0957 0.0890 0.0846 0.1011 0.0984 0.0933 0.1010 0.0928 0.1001 0.0780 0.0809 0.0781 0.0804
va: 2.1020 2.0539 2.0995 2.1096 3.0919 3.7003 3.8032 3.8213 3.8918 3.9052 3.8908 4.1537 3.7176 3.8599 3.9304 3.9335 3.6563 3.6964 3.9205 3.9182 3.9130 3.9173 4.2140 4.2242 1.0249 1.0282 1.0023 1.0168 1.0063 1.0027 1.0004 1.0028 1.0042 1.0171 1.0153 0.9970 0.9963 1.0064 1.0116 0.9994 0.9989 1.0155 1.0049 1.0160 1.0049 1.0068 1.0096 1.0066 1.0096
dispcorr: -0.023456985 hartree
energy: -1094.901956010428
dipole: 17.23128 -18.39889 -1.16761 8.98425 -8.24481 0.73944 -10.70268 9.19214 -1.51053
magnitude: 2.04739 au
magnitude: 5.20405 debye
