program: Orca
programVersion: 5.0.2
elementType: O O O O N C C C C C C C C C C C C C C C C C C C H H H H H H H H H H H H H H H H H H H H H H H H H
charge: 0
multiplicity: 1
keywords: wb97x-d3
keywords: def2-TZVPP
keywords: def2/J RIJCOSX
keywords: DEFGRID2
keywords: scfconv7
keywords: smallprint printgap noloewdin
keywords: NOSOSCF
formula: C19H25NO4
InChI: InChI=1/C19H25NO4/c1-11(2)9-14-15(19(14,3)4)18(23)24-10-20-16(21)12-7-5-6-8-13(12)17(20)22/h9,14-15H,5-8,10H2,1-4H3
49 atoms
O  0.100279 -1.17646 0.078831
O  1.399408 -1.248943 1.902249
O  -1.625425 1.076538 1.580655
O  -3.194353 -2.242143 -1.09381
N  -2.157341 -0.833447 0.410214
C  2.843661 1.049327 0.29907
C  3.674833 -0.200084 0.292817
C  2.220047 -0.272541 -0.123105
C  2.485845 1.670365 1.627548
C  3.021021 2.075738 -0.793822
C  4.730091 -0.4403 -0.710045
C  1.238765 -0.946863 0.745152
C  5.933274 -0.978981 -0.485585
C  -1.042505 -1.629823 0.796425
C  6.924918 -1.125289 -1.600913
C  6.423676 -1.450859 0.850569
C  -3.562998 0.968383 0.12734
C  -4.017362 -0.005368 -0.662842
C  -4.189395 2.303796 0.282735
C  -5.214942 0.089243 -1.532488
C  -5.601259 2.275217 -0.305574
C  -5.646231 1.552418 -1.651409
C  -2.342681 0.482268 0.817042
C  -3.122877 -1.183284 -0.526105
H  3.869181 -0.599221 1.282375
H  2.018701 -0.360966 -1.185191
H  2.496295 0.960514 2.451848
H  1.495878 2.131211 1.592161
H  3.204956 2.45597 1.868191
H  3.882947 2.712527 -0.583382
H  2.142083 2.720611 -0.85389
H  3.167779 1.633966 -1.778491
H  4.500019 -0.137096 -1.727282
H  -0.889561 -1.557634 1.871531
H  -1.240394 -2.668346 0.536366
H  7.861198 -0.612813 -1.362425
H  6.552248 -0.71992 -2.541721
H  7.182896 -2.175263 -1.764109
H  5.632091 -1.605588 1.580618
H  7.128919 -0.734443 1.279332
H  6.965708 -2.392957 0.750307
H  -4.211021 2.593988 1.335806
H  -3.572352 3.053539 -0.223072
H  -5.006054 -0.337882 -2.516162
H  -6.018747 -0.519373 -1.105809
H  -6.272926 1.774193 0.397299
H  -5.971219 3.29546 -0.4167
H  -4.987707 2.064283 -2.358828
H  -6.652605 1.602927 -2.069236
elementType: O N C H
totalener: -1094.87977663 hartree
nucrepener: 2054.22415916 hartree
electener: -3149.10393579 hartree
oneelecener: -5570.69294166 hartree
twoeener: 2421.58900588 hartree
cpcmener: -0.03048506 hartree
kineticenergy: 1090.03770945 hartree
xcener: -105.970831787648 hartree
chargesum: 0.0000000
charge: -0.279238 -0.456937 -0.415188 -0.408506 -0.096623 0.104032 0.032639 -0.082369 -0.274389 -0.275208 -0.277500 0.384801 -0.041125 0.079740 -0.215988 -0.261339 -0.049402 -0.087871 -0.074296 -0.071512 -0.135404 -0.135721 0.314018 0.324339 0.094124 0.090835 0.093101 0.094354 0.096976 0.098085 0.097395 0.088897 0.114616 0.138177 0.125756 0.092558 0.086190 0.093248 0.093516 0.102208 0.091410 0.093306 0.101675 0.093979 0.100731 0.078425 0.080853 0.078102 0.080533
qa: -0.2792 -0.4569 -0.4152 -0.4085 -0.0966 0.1040 0.0326 -0.0824 -0.2744 -0.2752 -0.2775 0.3848 -0.0411 0.0797 -0.2160 -0.2613 -0.0494 -0.0879 -0.0743 -0.0715 -0.1354 -0.1357 0.3140 0.3243 0.0941 0.0908 0.0931 0.0944 0.0970 0.0981 0.0974 0.0889 0.1146 0.1382 0.1258 0.0926 0.0862 0.0932 0.0935 0.1022 0.0914 0.0933 0.1017 0.0940 0.1007 0.0784 0.0809 0.0781 0.0805
va: 2.1065 2.0534 2.0957 2.1100 3.0956 3.6970 3.7917 3.8172 3.9044 3.9124 3.8879 4.1909 3.7569 3.8577 3.9223 3.9388 3.6542 3.7033 3.9200 3.9188 3.9140 3.9164 4.2117 4.2227 1.0271 1.0333 1.0180 1.0050 1.0006 1.0013 1.0015 1.0069 1.0119 1.0167 1.0120 0.9950 1.0094 0.9966 1.0089 0.9949 0.9982 1.0153 1.0049 1.0154 1.0049 1.0068 1.0096 1.0066 1.0096
dispcorr: -0.022231231 hartree
energy: -1094.902007860507
dipole: 21.97324 -23.08625 -1.11301 12.13990 -10.80744 1.33246 -5.79638 4.64116 -1.15522
magnitude: 2.08537 au
magnitude: 5.30059 debye
