program: Orca
programVersion: 5.0.2
elementType: O O O O N C C C C C C C C C C C C C C C C C C C H H H H H H H H H H H H H H H H H H H H H H H H H
charge: 0
multiplicity: 1
keywords: wb97x-d3
keywords: def2-TZVPP
keywords: def2/J RIJCOSX
keywords: DEFGRID2
keywords: scfconv7
keywords: smallprint printgap noloewdin
keywords: NOSOSCF
formula: C19H25NO4
InChI: InChI=1/C19H25NO4/c1-11(2)9-14-15(19(14,3)4)18(23)24-10-20-16(21)12-7-5-6-8-13(12)17(20)22/h9,14-15H,5-8,10H2,1-4H3
49 atoms
O  0.146789 -0.942964 -0.946984
O  1.238452 -2.206408 0.551441
O  -1.613639 -0.459932 1.647597
O  -3.14856 -0.727383 -2.618495
N  -2.13255 -0.889582 -0.553226
C  2.679628 0.565713 1.017155
C  3.592936 -0.398835 0.319126
C  2.203708 -0.16246 -0.231001
C  2.139906 0.187848 2.374622
C  2.907055 2.049826 0.866537
C  4.762135 0.044146 -0.467753
C  1.18297 -1.220828 -0.140568
C  6.017451 -0.399846 -0.34582
C  -1.030012 -1.736676 -0.866186
C  7.108974 0.138583 -1.221766
C  6.467441 -1.435463 0.638904
C  -3.492654 0.606796 0.548557
C  -3.950824 0.514474 -0.700513
C  -4.071132 1.464538 1.610852
C  -5.138869 1.228989 -1.228444
C  -5.048185 2.461914 0.985464
C  -5.94562 1.805197 -0.063223
C  -2.31086 -0.280173 0.681914
C  -3.076551 -0.41727 -1.4578
H  3.705449 -1.345029 0.83772
H  2.128868 0.459495 -1.116608
H  1.148085 0.615026 2.538351
H  2.798952 0.582805 3.150565
H  2.071216 -0.886997 2.527053
H  1.992929 2.600713 1.096815
H  3.214993 2.334208 -0.138876
H  3.679909 2.390438 1.558832
H  4.569734 0.806268 -1.21769
H  -0.931489 -2.518637 -0.116071
H  -1.205476 -2.197056 -1.836552
H  7.907343 0.587225 -0.624195
H  6.745852 0.894388 -1.918399
H  7.574317 -0.660259 -1.805742
H  6.936814 -2.278628 0.125104
H  5.667056 -1.830517 1.261364
H  7.228302 -1.022316 1.306537
H  -4.576731 0.835012 2.350177
H  -3.276358 1.983499 2.152165
H  -4.812424 2.024047 -1.907035
H  -5.751488 0.553663 -1.830821
H  -5.658058 2.915006 1.768205
H  -4.483007 3.274517 0.520238
H  -6.66824 2.528849 -0.442519
H  -6.522405 1.003306 0.405744
elementType: O N C H
totalener: -1094.87995200 hartree
nucrepener: 2064.09172666 hartree
electener: -3158.97167867 hartree
oneelecener: -5590.51449847 hartree
twoeener: 2431.54281980 hartree
cpcmener: -0.03097994 hartree
kineticenergy: 1090.03888574 hartree
xcener: -105.971178422483 hartree
chargesum: 0.0000000
charge: -0.282201 -0.452486 -0.413806 -0.408989 -0.093746 0.113239 0.036949 -0.105012 -0.278778 -0.264856 -0.275538 0.389049 -0.047364 0.079794 -0.219391 -0.250749 -0.055833 -0.086391 -0.070843 -0.071864 -0.136966 -0.135285 0.313305 0.325668 0.091709 0.090634 0.092348 0.098021 0.094648 0.097242 0.087140 0.097260 0.116845 0.140621 0.124474 0.092753 0.087414 0.093611 0.094761 0.090246 0.095440 0.100499 0.093540 0.101025 0.093050 0.081311 0.078465 0.080459 0.078580
qa: -0.2822 -0.4525 -0.4138 -0.4090 -0.0937 0.1132 0.0369 -0.1050 -0.2788 -0.2649 -0.2755 0.3890 -0.0474 0.0798 -0.2194 -0.2507 -0.0558 -0.0864 -0.0708 -0.0719 -0.1370 -0.1353 0.3133 0.3257 0.0917 0.0906 0.0923 0.0980 0.0946 0.0972 0.0871 0.0973 0.1168 0.1406 0.1245 0.0928 0.0874 0.0936 0.0948 0.0902 0.0954 0.1005 0.0935 0.1010 0.0931 0.0813 0.0785 0.0805 0.0786
va: 2.1084 2.0585 2.0993 2.1099 3.0930 3.6908 3.7775 3.8426 3.9004 3.9064 3.8707 4.1868 3.7611 3.8564 3.9221 3.9419 3.6601 3.6992 3.9187 3.9206 3.9148 3.9137 4.2136 4.2222 1.0334 1.0362 1.0074 1.0015 1.0176 1.0024 1.0058 1.0022 1.0108 1.0169 1.0150 0.9963 1.0090 0.9960 0.9970 1.0100 0.9974 1.0052 1.0155 1.0052 1.0156 1.0093 1.0067 1.0097 1.0066
dispcorr: -0.022578300 hartree
energy: -1094.902530302586
dipole: 21.98489 -22.97695 -0.99205 13.29196 -11.50212 1.78984 7.59212 -7.50646 0.08566
magnitude: 2.04818 au
magnitude: 5.20605 debye
