program: Orca
programVersion: 5.0.2
elementType: O O O O N C C C C C C C C C C C C C C C C C C C H H H H H H H H H H H H H H H H H H H H H H H H H
charge: 0
multiplicity: 1
keywords: wb97x-d3
keywords: def2-TZVPP
keywords: def2/J RIJCOSX
keywords: DEFGRID2
keywords: scfconv7
keywords: smallprint printgap noloewdin
keywords: NOSOSCF
formula: C19H25NO4
InChI: InChI=1/C19H25NO4/c1-11(2)9-14-15(19(14,3)4)18(23)24-10-20-16(21)12-7-5-6-8-13(12)17(20)22/h9,14-15H,5-8,10H2,1-4H3
49 atoms
O  0.297601 1.383094 0.09284
O  1.494286 1.189229 -1.79425
O  -3.011556 2.789224 1.169128
O  -1.538088 -0.556569 -1.526733
N  -1.981145 1.342627 -0.304432
C  2.60808 -1.304359 -0.231312
C  3.624622 -0.204263 -0.260071
C  2.224565 0.104492 0.206449
C  2.104297 -1.872072 -1.53486
C  2.681888 -2.330345 0.871533
C  4.74408 -0.140308 0.714073
C  1.337351 0.934864 -0.625975
C  5.971891 -0.618375 0.495109
C  -0.76953 2.046521 -0.571082
C  7.047468 -0.50738 1.531926
C  6.37784 -1.302442 -0.773956
C  -3.993495 0.656472 0.576384
C  -3.559484 -0.33014 -0.20923
C  -5.277728 0.652641 1.318784
C  -4.2702 -1.609451 -0.445971
C  -6.167778 -0.472527 0.787216
C  -5.386344 -1.769498 0.587919
C  -2.985789 1.747678 0.565997
C  -2.253561 0.070527 -0.787327
H  3.851471 0.163194 -1.257193
H  2.082211 0.220828 1.275798
H  2.703113 -2.74437 -1.80612
H  2.164393 -1.170036 -2.363547
H  1.067294 -2.203653 -1.447823
H  3.394254 -3.1169 0.611876
H  1.709639 -2.803607 1.023341
H  2.994981 -1.903476 1.824111
H  4.537016 0.328731 1.671942
H  -0.594635 2.10464 -1.643581
H  -0.856626 3.055061 -0.171193
H  6.698945 -0.007796 2.43602
H  7.90761 0.049501 1.150343
H  7.421799 -1.494828 1.815472
H  5.574567 -1.36598 -1.506617
H  6.71881 -2.320836 -0.568571
H  7.219976 -0.786837 -1.243238
H  -5.079448 0.519585 2.387259
H  -5.77408 1.621458 1.224236
H  -4.677081 -1.615312 -1.462426
H  -3.569944 -2.447038 -0.398965
H  -6.999104 -0.636262 1.474372
H  -6.606501 -0.163761 -0.165977
H  -6.059382 -2.570225 0.278176
H  -4.950349 -2.07893 1.54208
elementType: O N C H
totalener: -1094.87861260 hartree
nucrepener: 2066.77923767 hartree
electener: -3161.65785027 hartree
oneelecener: -5595.93907220 hartree
twoeener: 2434.28122193 hartree
cpcmener: -0.03032543 hartree
kineticenergy: 1090.04514578 hartree
xcener: -105.971562822146 hartree
chargesum: 0.0000000
charge: -0.283792 -0.454232 -0.409354 -0.415453 -0.092881 0.139583 -0.020215 -0.109016 -0.298386 -0.270914 -0.251166 0.393915 -0.038243 0.079985 -0.229604 -0.248245 -0.082998 -0.057955 -0.072633 -0.071057 -0.135324 -0.136163 0.324035 0.315034 0.101079 0.093000 0.097745 0.097519 0.095654 0.096056 0.100121 0.091644 0.120349 0.142013 0.123565 0.089035 0.094722 0.093213 0.087467 0.095905 0.099380 0.100984 0.093120 0.100303 0.093610 0.081136 0.078107 0.081087 0.078268
qa: -0.2838 -0.4542 -0.4094 -0.4155 -0.0929 0.1396 -0.0202 -0.1090 -0.2984 -0.2709 -0.2512 0.3939 -0.0382 0.0800 -0.2296 -0.2482 -0.0830 -0.0580 -0.0726 -0.0711 -0.1353 -0.1362 0.3240 0.3150 0.1011 0.0930 0.0977 0.0975 0.0957 0.0961 0.1001 0.0916 0.1203 0.1420 0.1236 0.0890 0.0947 0.0932 0.0875 0.0959 0.0994 0.1010 0.0931 0.1003 0.0936 0.0811 0.0781 0.0811 0.0783
va: 2.1082 2.0565 2.1105 2.0980 3.0917 3.6684 3.8075 3.8647 3.8944 3.9063 3.8599 4.1938 3.7064 3.8532 3.9288 3.9385 3.6987 3.6619 3.9194 3.9189 3.9121 3.9143 4.2242 4.2143 1.0245 1.0354 1.0019 1.0166 1.0075 1.0018 1.0030 1.0023 1.0069 1.0158 1.0160 1.0076 0.9956 0.9962 1.0083 0.9975 0.9990 1.0052 1.0157 1.0053 1.0156 1.0095 1.0070 1.0094 1.0068
dispcorr: -0.023215943 hartree
energy: -1094.901828545124
dipole: 19.68422 -20.86263 -1.17842 -19.90348 18.54315 -1.36033 4.77543 -3.71955 1.05589
magnitude: 2.08664 au
magnitude: 5.30381 debye
