program: Orca
programVersion: 5.0.2
elementType: O O O O N C C C C C C C C C C C C C C C C C C C H H H H H H H H H H H H H H H H H H H H H H H H H
charge: 0
multiplicity: 1
keywords: wb97x-d3
keywords: def2-TZVPP
keywords: def2/J RIJCOSX
keywords: DEFGRID2
keywords: scfconv7
keywords: smallprint printgap noloewdin
keywords: NOSOSCF
formula: C19H25NO4
InChI: InChI=1/C19H25NO4/c1-11(2)9-14-15(19(14,3)4)18(23)24-10-20-16(21)12-7-5-6-8-13(12)17(20)22/h9,14-15H,5-8,10H2,1-4H3
49 atoms
O  0.618407 1.394918 -1.434503
O  0.284674 -0.811302 -1.269448
O  -2.736327 -0.496221 -2.081968
O  -1.158253 2.798154 0.62472
N  -1.700551 1.271042 -1.013352
C  2.366447 -0.016917 1.103019
C  2.847322 -1.10008 0.190097
C  2.291987 0.170297 -0.404829
C  1.097992 -0.244009 1.890224
C  3.36535 0.858077 1.818699
C  4.283474 -1.448167 0.038252
C  0.979753 0.155375 -1.077072
C  4.793254 -2.123128 -0.995494
C  -0.683995 1.595216 -1.964268
C  6.245723 -2.486032 -1.053008
C  3.975488 -2.574828 -2.166232
C  -3.285192 0.112403 0.19267
C  -2.835748 1.087997 0.982759
C  -4.309219 -0.890732 0.574268
C  -3.295351 1.345271 2.369366
C  -4.497938 -0.869035 2.09245
C  -4.578632 0.55713 2.636321
C  -2.580115 0.195926 -1.110906
C  -1.80375 1.855374 0.242374
H  2.167566 -1.944903 0.113041
H  2.997891 0.887546 -0.810918
H  0.58449 0.699786 2.087429
H  1.334963 -0.694476 2.856211
H  0.397037 -0.910447 1.388712
H  3.686764 0.39602 2.754762
H  2.917862 1.822999 2.065366
H  4.255922 1.055662 1.22181
H  4.951842 -1.158292 0.844015
H  -0.850154 1.007235 -2.866944
H  -0.721163 2.651326 -2.220606
H  6.721518 -2.069554 -1.944933
H  6.376479 -3.570009 -1.112369
H  6.794549 -2.129935 -0.180977
H  4.000936 -3.663983 -2.260356
H  4.386544 -2.177987 -3.09841
H  2.931581 -2.269922 -2.108896
H  -5.250368 -0.662939 0.062933
H  -4.013942 -1.885187 0.230804
H  -2.505208 1.050676 3.06826
H  -3.452397 2.414917 2.528275
H  -5.400076 -1.42253 2.356781
H  -3.660822 -1.390645 2.565627
H  -4.780305 0.538779 3.708319
H  -5.421677 1.074012 2.168691
elementType: O N C H
totalener: -1094.87725592 hartree
nucrepener: 2149.37192578 hartree
electener: -3244.24918170 hartree
oneelecener: -5761.25543288 hartree
twoeener: 2517.00625119 hartree
cpcmener: -0.03143863 hartree
kineticenergy: 1090.03576477 hartree
xcener: -105.969838618844 hartree
chargesum: 0.0000000
charge: -0.275538 -0.451277 -0.400604 -0.408320 -0.096252 0.172648 -0.045877 -0.101081 -0.278006 -0.298661 -0.277427 0.385907 -0.019826 0.082650 -0.229037 -0.242527 -0.037043 -0.089274 -0.074245 -0.066261 -0.135500 -0.137684 0.299552 0.292032 0.101912 0.098327 0.091595 0.104581 0.091192 0.100655 0.099662 0.090968 0.123068 0.133062 0.142981 0.093792 0.094260 0.088915 0.098439 0.095104 0.077271 0.100116 0.093410 0.099886 0.094278 0.080824 0.078732 0.081200 0.077422
qa: -0.2755 -0.4513 -0.4006 -0.4083 -0.0963 0.1726 -0.0459 -0.1011 -0.2780 -0.2987 -0.2774 0.3859 -0.0198 0.0827 -0.2290 -0.2425 -0.0370 -0.0893 -0.0742 -0.0663 -0.1355 -0.1377 0.2996 0.2920 0.1019 0.0983 0.0916 0.1046 0.0912 0.1007 0.0997 0.0910 0.1231 0.1331 0.1430 0.0938 0.0943 0.0889 0.0984 0.0951 0.0773 0.1001 0.0934 0.0999 0.0943 0.0808 0.0787 0.0812 0.0774
va: 2.1203 2.0464 2.1153 2.0999 3.0651 3.7245 3.8515 3.8080 3.8799 3.9053 3.8820 4.1858 3.7143 3.8942 3.9294 3.9375 3.6208 3.6949 3.9142 3.9185 3.9140 3.9185 4.2164 4.1975 1.0230 1.0294 1.0090 1.0022 1.0127 0.9984 1.0028 1.0011 1.0027 1.0149 0.9922 0.9965 0.9958 1.0068 0.9992 0.9987 1.0228 1.0043 1.0159 1.0063 1.0157 1.0095 1.0073 1.0094 1.0063
dispcorr: -0.025405104 hartree
energy: -1094.902661025266
dipole: 17.29198 -17.59670 -0.30471 -11.93867 12.09706 0.15838 12.72456 -11.45406 1.27050
magnitude: 1.31609 au
magnitude: 3.34524 debye
