program: Orca
programVersion: 5.0.2
elementType: O O O O N C C C C C C C C C C C C C C C C C C C H H H H H H H H H H H H H H H H H H H H H H H H H
charge: 0
multiplicity: 1
keywords: wb97x-d3
keywords: def2-TZVPP
keywords: def2/J RIJCOSX
keywords: DEFGRID2
keywords: scfconv7
keywords: smallprint printgap noloewdin
keywords: NOSOSCF
formula: C19H25NO4
InChI: InChI=1/C19H25NO4/c1-11(2)9-14-15(19(14,3)4)18(23)24-10-20-16(21)12-7-5-6-8-13(12)17(20)22/h9,14-15H,5-8,10H2,1-4H3
49 atoms
O  0.614775 1.279104 -1.475676
O  0.258439 -0.914358 -1.220949
O  -2.784655 -0.572148 -2.05962
O  -1.11491 2.761344 0.541514
N  -1.703794 1.202571 -1.050431
C  2.34266 -0.055342 1.124319
C  2.826806 -1.163998 0.24554
C  2.271411 0.083883 -0.390031
C  1.076623 -0.256422 1.92081
C  3.344115 0.839156 1.811549
C  4.268061 -1.502833 0.110801
C  0.962616 0.052928 -1.067304
C  4.830482 -2.007772 -0.99003
C  -0.684272 1.473064 -2.015406
C  6.286591 -2.356426 -1.035633
C  4.072103 -2.267891 -2.255007
C  -3.301617 0.111766 0.200689
C  -2.824746 1.098603 0.95948
C  -4.343826 -0.857662 0.617283
C  -3.266118 1.403677 2.342047
C  -4.524492 -0.787483 2.134795
C  -4.566021 0.654019 2.639988
C  -2.6054 0.143588 -1.109727
C  -1.782759 1.822486 0.189789
H  2.152676 -2.015768 0.19489
H  2.980271 0.787549 -0.8138
H  1.315683 -0.687809 2.895108
H  0.366844 -0.927325 1.438093
H  0.571558 0.6954 2.100935
H  3.652364 0.413192 2.768632
H  2.90532 1.818157 2.014132
H  4.241701 1.000183 1.214764
H  4.891904 -1.353615 0.987885
H  -0.85792 0.847984 -2.891236
H  -0.707526 2.517148 -2.317766
H  6.797873 -1.806049 -1.829981
H  6.429459 -3.417737 -1.255988
H  6.793127 -2.137615 -0.09544
H  3.010159 -2.04163 -2.177282
H  4.167721 -3.314994 -2.554225
H  4.480454 -1.676538 -3.079135
H  -5.282065 -0.626287 0.103162
H  -4.070706 -1.867644 0.303353
H  -2.477453 1.108137 3.0424
H  -3.396094 2.480555 2.474512
H  -5.43924 -1.31034 2.418077
H  -3.699276 -1.31763 2.619242
H  -4.758587 0.669592 3.713284
H  -5.399886 1.179393 2.16604
elementType: O N C H
totalener: -1094.87706272 hartree
nucrepener: 2152.41082886 hartree
electener: -3247.28789158 hartree
oneelecener: -5767.31925453 hartree
twoeener: 2520.03136295 hartree
cpcmener: -0.03131673 hartree
kineticenergy: 1090.05014458 hartree
xcener: -105.972515774906 hartree
chargesum: 0.0000000
charge: -0.274578 -0.452092 -0.401008 -0.407664 -0.097058 0.172513 -0.024844 -0.126236 -0.282018 -0.293840 -0.291790 0.390401 -0.018849 0.084127 -0.228677 -0.237474 -0.037591 -0.090140 -0.073328 -0.066344 -0.135896 -0.137206 0.299216 0.292837 0.104043 0.099370 0.104716 0.091378 0.090860 0.098788 0.099248 0.092975 0.122959 0.133381 0.142725 0.093619 0.095367 0.089077 0.077249 0.099039 0.097044 0.099982 0.093323 0.099873 0.094424 0.080868 0.078722 0.081093 0.077412
qa: -0.2746 -0.4521 -0.4010 -0.4077 -0.0971 0.1725 -0.0248 -0.1262 -0.2820 -0.2938 -0.2918 0.3904 -0.0188 0.0841 -0.2287 -0.2375 -0.0376 -0.0901 -0.0733 -0.0663 -0.1359 -0.1372 0.2992 0.2928 0.1040 0.0994 0.1047 0.0914 0.0909 0.0988 0.0992 0.0930 0.1230 0.1334 0.1427 0.0936 0.0954 0.0891 0.0772 0.0990 0.0970 0.1000 0.0933 0.0999 0.0944 0.0809 0.0787 0.0811 0.0774
va: 2.1201 2.0480 2.1152 2.1004 3.0663 3.7100 3.8378 3.8073 3.8859 3.9022 3.8864 4.1839 3.7139 3.8915 3.9304 3.9325 3.6223 3.6963 3.9140 3.9182 3.9146 3.9187 4.2160 4.1973 1.0244 1.0286 1.0023 1.0126 1.0089 0.9992 1.0033 1.0014 1.0024 1.0149 0.9922 0.9966 0.9961 1.0063 1.0224 1.0000 0.9987 1.0044 1.0159 1.0063 1.0158 1.0094 1.0072 1.0094 1.0063
dispcorr: -0.025606295 hartree
energy: -1094.902669015137
dipole: 17.51905 -17.78694 -0.26789 -10.52439 10.77628 0.25189 12.77700 -11.53831 1.23869
magnitude: 1.29212 au
magnitude: 3.28431 debye
