program: Orca
programVersion: 5.0.2
elementType: O O O O N C C C C C C C C C C C C C C C C C C C H H H H H H H H H H H H H H H H H H H H H H H H H
charge: 0
multiplicity: 1
keywords: wb97x-d3
keywords: def2-TZVPP
keywords: def2/J RIJCOSX
keywords: DEFGRID2
keywords: scfconv7
keywords: smallprint printgap noloewdin
keywords: NOSOSCF
formula: C19H25NO4
InChI: InChI=1/C19H25NO4/c1-11(2)9-14-15(19(14,3)4)18(23)24-10-20-16(21)12-7-5-6-8-13(12)17(20)22/h9,14-15H,5-8,10H2,1-4H3
49 atoms
O  0.403941 0.836267 -0.097768
O  1.848606 2.25504 0.832566
O  -1.940409 -0.494816 1.924364
O  -2.413165 1.871757 -1.925387
N  -1.880082 0.923286 0.108378
C  3.916388 0.762771 -1.019641
C  4.008141 0.236619 0.36892
C  2.649264 0.304853 -0.306854
C  4.17627 2.227813 -1.266879
C  4.348987 -0.115903 -2.168662
C  4.614138 -1.081507 0.688542
C  1.638652 1.243902 0.203365
C  4.22027 -1.878792 1.684865
C  -0.678879 1.62012 0.403231
C  4.899113 -3.185989 1.954168
C  3.077182 -1.549773 2.59534
C  -3.623013 -0.578185 0.186251
C  -3.757639 0.11195 -0.947457
C  -4.552235 -1.631742 0.660746
C  -4.846916 -0.074546 -1.936164
C  -5.851186 -1.562799 -0.144377
C  -5.589316 -1.378734 -1.63853
C  -2.406077 -0.101562 0.886658
C  -2.641068 1.084788 -1.043997
H  4.146615 1.003226 1.128371
H  2.247298 -0.637356 -0.662082
H  3.953779 2.855472 -0.407053
H  3.593235 2.595429 -2.113712
H  5.231159 2.372581 -1.509683
H  5.426506 -0.036984 -2.329481
H  3.85621 0.193774 -3.092424
H  4.113044 -1.168043 -2.007889
H  5.452746 -1.398249 0.074303
H  -0.701983 2.598747 -0.076382
H  -0.592658 1.754796 1.481535
H  5.689456 -3.396498 1.233579
H  4.184456 -4.012999 1.922369
H  5.341595 -3.200465 2.95381
H  3.356691 -1.705102 3.640043
H  2.227506 -2.211086 2.403229
H  2.726001 -0.524201 2.494854
H  -4.076171 -2.611434 0.548141
H  -4.747116 -1.514275 1.729478
H  -5.528396 0.781021 -1.88651
H  -4.444112 -0.077413 -2.952025
H  -6.434526 -2.469263 0.024481
H  -6.456493 -0.728632 0.222741
H  -6.531877 -1.395211 -2.187958
H  -4.997839 -2.221464 -2.008934
elementType: O N C H
totalener: -1094.88019424 hartree
nucrepener: 2058.94009193 hartree
electener: -3153.82028617 hartree
oneelecener: -5579.95477766 hartree
twoeener: 2426.13449149 hartree
cpcmener: -0.02930262 hartree
kineticenergy: 1090.04289137 hartree
xcener: -105.969771012641 hartree
chargesum: 0.0000000
charge: -0.277728 -0.475226 -0.409705 -0.407490 -0.112417 0.149734 -0.018389 -0.085607 -0.275986 -0.285673 -0.295508 0.384582 -0.004904 0.087083 -0.227870 -0.245283 -0.070990 -0.074221 -0.073927 -0.070728 -0.135087 -0.137228 0.323466 0.318645 0.101338 0.091704 0.091961 0.099121 0.094458 0.098534 0.098111 0.092393 0.121355 0.132802 0.129176 0.088874 0.093493 0.095921 0.099004 0.101603 0.082984 0.101013 0.093527 0.100642 0.093687 0.080998 0.078227 0.081305 0.078229
qa: -0.2777 -0.4752 -0.4097 -0.4075 -0.1124 0.1497 -0.0184 -0.0856 -0.2760 -0.2857 -0.2955 0.3846 -0.0049 0.0871 -0.2279 -0.2453 -0.0710 -0.0742 -0.0739 -0.0707 -0.1351 -0.1372 0.3235 0.3186 0.1013 0.0917 0.0920 0.0991 0.0945 0.0985 0.0981 0.0924 0.1214 0.1328 0.1292 0.0889 0.0935 0.0959 0.0990 0.1016 0.0830 0.1010 0.0935 0.1006 0.0937 0.0810 0.0782 0.0813 0.0782
va: 2.1052 2.0264 2.1074 2.1109 3.1249 3.7069 3.8215 3.8238 3.8898 3.9118 3.8946 4.1290 3.6995 3.8872 3.9324 3.9398 3.6656 3.6783 3.9226 3.9201 3.9127 3.9163 4.2134 4.2182 1.0261 1.0295 1.0188 0.9993 1.0007 0.9997 1.0029 1.0017 1.0035 1.0037 1.0025 1.0062 0.9961 0.9963 1.0003 0.9981 1.0134 1.0050 1.0151 1.0048 1.0155 1.0096 1.0067 1.0092 1.0067
dispcorr: -0.022466640 hartree
energy: -1094.902660875673
dipole: 15.90595 -17.29927 -1.39332 -14.32469 12.65189 -1.67280 -1.40654 0.76239 -0.64415
magnitude: 2.27036 au
magnitude: 5.77081 debye
