program: Orca
programVersion: 5.0.2
elementType: O O O O N C C C C C C C C C C C C C C C C C C C H H H H H H H H H H H H H H H H H H H H H H H H H
charge: 0
multiplicity: 1
keywords: wb97x-d3
keywords: def2-TZVPP
keywords: def2/J RIJCOSX
keywords: DEFGRID2
keywords: scfconv7
keywords: smallprint printgap noloewdin
keywords: NOSOSCF
formula: C19H25NO4
InChI: InChI=1/C19H25NO4/c1-11(2)9-14-15(19(14,3)4)18(23)24-10-20-16(21)12-7-5-6-8-13(12)17(20)22/h9,14-15H,5-8,10H2,1-4H3
49 atoms
O  0.159118 0.668331 0.056054
O  1.802656 2.03535 -0.578826
O  -2.759103 1.540574 1.948555
O  -2.025511 0.099726 -2.295411
N  -2.08196 1.059307 -0.203064
C  3.126948 -0.811629 -1.100627
C  3.798219 -0.092957 0.033794
C  2.291768 -0.231466 0.029369
C  3.125712 -0.156982 -2.460487
C  3.176684 -2.318038 -1.176724
C  4.584487 -0.793416 1.067733
C  1.438275 0.949058 -0.195927
C  5.770201 -0.419928 1.560801
C  -0.806105 1.681446 -0.222013
C  6.452901 -1.243692 2.611913
C  6.531698 0.801804 1.144955
C  -4.088005 0.155458 0.472315
C  -3.871997 -0.272493 -0.772444
C  -5.290287 -0.155836 1.283032
C  -4.780746 -1.153413 -1.544975
C  -6.3832 -0.719116 0.372547
C  -5.832225 -1.752964 -0.6087
C  -2.939333 0.998655 0.889349
C  -2.575543 0.275042 -1.239334
H  4.146986 0.900326 -0.227243
H  1.86754 -0.970419 0.700987
H  2.221086 -0.410221 -3.017833
H  3.978006 -0.516752 -3.040298
H  3.200722 0.92771 -2.41665
H  4.107906 -2.647694 -1.642268
H  2.352346 -2.694641 -1.78583
H  3.105457 -2.798119 -0.201552
H  4.145041 -1.704642 1.463437
H  -0.630389 2.126901 -1.200782
H  -0.773649 2.464043 0.536004
H  6.629129 -0.657803 3.518144
H  7.434621 -1.582463 2.269316
H  5.873292 -2.124301 2.889548
H  6.026692 1.407228 0.395082
H  7.508296 0.525039 0.739013
H  6.730162 1.441391 2.008806
H  -5.024881 -0.876598 2.063248
H  -5.638939 0.738103 1.805603
H  -5.254617 -0.571204 -2.341919
H  -4.211094 -1.93923 -2.047039
H  -7.171975 -1.164203 0.980656
H  -6.84337 0.101252 -0.185801
H  -6.644624 -2.179169 -1.198915
H  -5.386244 -2.579826 -0.048682
elementType: O N C H
totalener: -1094.88129730 hartree
nucrepener: 2033.13014526 hartree
electener: -3128.01144255 hartree
oneelecener: -5528.30711319 hartree
twoeener: 2400.29567063 hartree
cpcmener: -0.03062294 hartree
kineticenergy: 1090.04412606 hartree
xcener: -105.970916675314 hartree
chargesum: -0.0000000
charge: -0.272808 -0.466789 -0.407826 -0.409683 -0.111954 0.097621 0.039879 -0.082175 -0.272688 -0.271081 -0.272358 0.391353 -0.052171 0.088196 -0.216987 -0.250113 -0.072949 -0.066448 -0.077258 -0.070517 -0.134285 -0.137985 0.320710 0.315543 0.089033 0.090913 0.099600 0.097548 0.091569 0.097764 0.098029 0.087338 0.115875 0.130522 0.132668 0.092645 0.092053 0.087378 0.089930 0.095532 0.094625 0.101306 0.094027 0.100873 0.094236 0.081040 0.078338 0.081553 0.078379
qa: -0.2728 -0.4668 -0.4078 -0.4097 -0.1120 0.0976 0.0399 -0.0822 -0.2727 -0.2711 -0.2724 0.3914 -0.0522 0.0882 -0.2170 -0.2501 -0.0729 -0.0664 -0.0773 -0.0705 -0.1343 -0.1380 0.3207 0.3155 0.0890 0.0909 0.0996 0.0975 0.0916 0.0978 0.0980 0.0873 0.1159 0.1305 0.1327 0.0926 0.0921 0.0874 0.0899 0.0955 0.0946 0.1013 0.0940 0.1009 0.0942 0.0810 0.0783 0.0816 0.0784
va: 2.1119 2.0402 2.1102 2.1054 3.1212 3.7126 3.7750 3.8435 3.9031 3.9099 3.8773 4.1730 3.7700 3.8781 3.9210 3.9403 3.6796 3.6699 3.9217 3.9203 3.9124 3.9165 4.2175 4.2171 1.0341 1.0332 1.0005 1.0004 1.0180 1.0017 1.0016 1.0065 1.0115 1.0033 1.0047 0.9965 0.9963 1.0092 1.0106 0.9972 0.9970 1.0050 1.0153 1.0048 1.0151 1.0096 1.0067 1.0093 1.0065
dispcorr: -0.021664959 hartree
energy: -1094.902962254303
dipole: 20.88974 -22.28906 -1.39932 -14.24468 12.64572 -1.59895 1.06503 -0.94092 0.12411
magnitude: 2.12841 au
magnitude: 5.40999 debye
