program: Orca
programVersion: 5.0.2
elementType: O O O O N C C C C C C C C C C C C C C C C C C C H H H H H H H H H H H H H H H H H H H H H H H H H
charge: 0
multiplicity: 1
keywords: wb97x-d3
keywords: def2-TZVPP
keywords: def2/J RIJCOSX
keywords: DEFGRID2
keywords: scfconv7
keywords: smallprint printgap noloewdin
keywords: NOSOSCF
formula: C19H25NO4
InChI: InChI=1/C19H25NO4/c1-11(2)9-14-15(19(14,3)4)18(23)24-10-20-16(21)12-7-5-6-8-13(12)17(20)22/h9,14-15H,5-8,10H2,1-4H3
49 atoms
O  0.115194 -0.899533 -0.851989
O  1.310274 -2.252796 0.481872
O  -1.727334 -0.412775 1.75599
O  -3.108251 -0.746059 -2.564712
N  -2.161614 -0.876897 -0.461446
C  2.732881 0.520399 1.033497
C  3.620235 -0.422294 0.27302
C  2.220693 -0.15867 -0.224628
C  2.218736 0.094123 2.387081
C  2.976641 2.006618 0.934251
C  4.778084 0.036855 -0.519988
C  1.205754 -1.229216 -0.136183
C  6.039867 -0.379462 -0.392617
C  -1.039848 -1.712409 -0.732641
C  7.121993 0.158532 -1.280318
C  6.502743 -1.391064 0.611602
C  -3.56462 0.627382 0.570579
C  -3.96791 0.529552 -0.695671
C  -4.193939 1.485663 1.604575
C  -5.129772 1.246128 -1.278759
C  -5.138725 2.485133 0.933794
C  -5.989285 1.826318 -0.153469
C  -2.381284 -0.25298 0.76333
C  -3.070103 -0.417318 -1.412175
H  3.730305 -1.393162 0.74344
H  2.113955 0.491552 -1.086616
H  1.23273 0.519658 2.583407
H  2.897089 0.450213 3.164541
H  2.13681 -0.985297 2.488458
H  2.071778 2.559818 1.191252
H  3.283894 2.322078 -0.061846
H  3.761309 2.309798 1.629532
H  4.571327 0.781579 -1.283424
H  -0.917032 -2.445432 0.062818
H  -1.216797 -2.22357 -1.678101
H  7.913084 0.632647 -0.69374
H  6.744757 0.893685 -1.990249
H  7.596857 -0.643839 -1.850734
H  6.958933 -2.250399 0.113956
H  5.708317 -1.7628 1.254189
H  7.272831 -0.962986 1.257945
H  -4.736134 0.855499 2.317019
H  -3.42696 1.998177 2.189559
H  -4.769893 2.039841 -1.941763
H  -5.711528 0.573922 -1.913424
H  -5.781509 2.947193 1.684403
H  -4.549635 3.293311 0.490797
H  -6.697166 2.547778 -0.563714
H  -6.585621 1.025025 0.291664
totalener: -1094.85535199 hartree
nucrepener: 2058.18775248 hartree
electener: -3153.04310447 hartree
oneelecener: -5578.27922937 hartree
twoeener: 2425.23612490 hartree
kineticenergy: 1090.09976228 hartree
xcener: -105.972788735759 hartree
chargesum: 0.0000000
charge: -0.270275 -0.375832 -0.322647 -0.319571 -0.110864 0.092998 0.036559 -0.103014 -0.250363 -0.240524 -0.191479 0.344970 -0.044363 0.068425 -0.206190 -0.236909 -0.070923 -0.102992 -0.073513 -0.073555 -0.135270 -0.135590 0.253640 0.270802 0.089945 0.072813 0.090502 0.083186 0.097069 0.090761 0.069768 0.090941 0.072986 0.138842 0.114315 0.083254 0.075894 0.085344 0.086678 0.084677 0.083804 0.092812 0.093830 0.093574 0.093263 0.080355 0.075786 0.079961 0.076119
qa: -0.2703 -0.3758 -0.3226 -0.3196 -0.1109 0.0930 0.0366 -0.1030 -0.2504 -0.2405 -0.1915 0.3450 -0.0444 0.0684 -0.2062 -0.2369 -0.0709 -0.1030 -0.0735 -0.0736 -0.1353 -0.1356 0.2536 0.2708 0.0899 0.0728 0.0905 0.0832 0.0971 0.0908 0.0698 0.0909 0.0730 0.1388 0.1143 0.0833 0.0759 0.0853 0.0867 0.0847 0.0838 0.0928 0.0938 0.0936 0.0933 0.0804 0.0758 0.0800 0.0761
va: 2.1099 2.1324 2.1845 2.1953 3.0877 3.7581 3.7797 3.8888 3.9131 3.9081 3.9004 4.2249 3.8133 3.8800 3.9367 3.9472 3.6139 3.6566 3.9252 3.9252 3.8983 3.8980 4.2738 4.2774 1.0372 1.0374 1.0082 1.0005 1.0214 1.0046 1.0106 1.0051 1.0199 1.0153 1.0120 0.9983 1.0122 0.9978 0.9991 1.0146 0.9996 1.0083 1.0193 1.0084 1.0195 1.0116 1.0087 1.0117 1.0085
dispcorr: -0.022450688 hartree
energy: -1094.877802681059
dipole: 22.19984 -23.00888 -0.80904 13.15467 -11.83316 1.32151 7.10849 -6.93542 0.17307
magnitude: 1.55913 au
magnitude: 3.96300 debye
