program: Orca
programVersion: 5.0.2
elementType: O O O O N C C C C C C C C C C C C C C C C C C C H H H H H H H H H H H H H H H H H H H H H H H H H
charge: 0
multiplicity: 1
keywords: wb97x-d3
keywords: def2-TZVPP
keywords: def2/J RIJCOSX
keywords: DEFGRID2
keywords: scfconv7
keywords: smallprint printgap noloewdin
keywords: NOSOSCF
formula: C19H25NO4
InChI: InChI=1/C19H25NO4/c1-11(2)9-14-15(19(14,3)4)18(23)24-10-20-16(21)12-7-5-6-8-13(12)17(20)22/h9,14-15H,5-8,10H2,1-4H3
49 atoms
O  0.594349 0.973384 -0.590537
O  1.892424 2.401034 -1.708975
O  -2.199728 -0.418954 -2.232698
O  -1.737423 2.034389 1.571677
N  -1.695938 1.035018 -0.508914
C  3.23443 0.770875 1.119328
C  2.815212 -0.506946 0.464813
C  2.932489 0.745622 -0.369799
C  2.288621 1.451745 2.079229
C  4.687957 0.965108 1.47963
C  3.770247 -1.6295 0.271466
C  1.784035 1.465204 -0.96236
C  3.897563 -2.364844 -0.833889
C  -0.5514 1.677614 -1.050489
C  4.89445 -3.481312 -0.913411
C  3.077065 -2.156525 -2.069688
C  -3.435446 -0.429132 -0.151334
C  -3.304289 0.293263 0.9609
C  -4.448551 -1.492661 -0.363627
C  -4.161591 0.169349 2.166294
C  -5.076379 -1.87469 0.97852
C  -5.411145 -0.644767 1.823291
C  -2.401535 0.00506 -1.129817
C  -2.170823 1.23998 0.784486
H  1.795911 -0.81138 0.688032
H  3.810348 0.822353 -1.001741
H  2.448955 2.531402 2.084347
H  2.468659 1.089877 3.09327
H  1.239471 1.274094 1.853421
H  4.898663 0.556995 2.470406
H  4.938232 2.026878 1.500423
H  5.359603 0.479724 0.771914
H  4.396199 -1.876213 1.124938
H  -0.610418 1.653224 -2.138495
H  -0.522232 2.714737 -0.715638
H  5.464887 -3.588671 0.008391
H  5.602372 -3.316062 -1.729503
H  4.402205 -4.435194 -1.117549
H  2.318331 -1.386184 -1.956559
H  2.568368 -3.082151 -2.349093
H  3.711145 -1.886139 -2.917795
H  -5.211359 -1.132559 -1.061043
H  -3.993597 -2.359481 -0.847069
H  -3.591708 -0.311536 2.967815
H  -4.426908 1.158455 2.546107
H  -5.975149 -2.468936 0.809078
H  -4.381415 -2.513245 1.530679
H  -5.918178 -0.946798 2.740701
H  -6.114135 -0.010516 1.275612
totalener: -1094.85310652 hartree
nucrepener: 2101.55558877 hartree
electener: -3196.40869529 hartree
oneelecener: -5664.73024287 hartree
twoeener: 2468.32154758 hartree
kineticenergy: 1090.09583740 hartree
xcener: -105.970450206682 hartree
chargesum: 0.0000000
charge: -0.267623 -0.356593 -0.316529 -0.320963 -0.117853 0.115014 0.037084 -0.124890 -0.247109 -0.276503 -0.271014 0.322885 -0.003637 0.069484 -0.211846 -0.221555 -0.090064 -0.079692 -0.073648 -0.075686 -0.135376 -0.135160 0.262386 0.252533 0.095095 0.095138 0.093851 0.082293 0.083641 0.087344 0.095199 0.086204 0.092708 0.126259 0.127696 0.078080 0.085278 0.086247 0.083651 0.089497 0.089023 0.092694 0.094893 0.093709 0.094665 0.080226 0.076174 0.080695 0.076096
qa: -0.2676 -0.3566 -0.3165 -0.3210 -0.1179 0.1150 0.0371 -0.1249 -0.2471 -0.2765 -0.2710 0.3229 -0.0036 0.0695 -0.2118 -0.2216 -0.0901 -0.0797 -0.0736 -0.0757 -0.1354 -0.1352 0.2624 0.2525 0.0951 0.0951 0.0939 0.0823 0.0836 0.0873 0.0952 0.0862 0.0927 0.1263 0.1277 0.0781 0.0853 0.0862 0.0837 0.0895 0.0890 0.0927 0.0949 0.0937 0.0947 0.0802 0.0762 0.0807 0.0761
va: 2.0683 2.1462 2.1963 2.1873 3.1118 3.7355 3.7600 3.8598 3.9126 3.9125 3.9099 4.1996 3.7312 3.9128 3.9422 3.9364 3.6384 3.6262 3.9249 3.9281 3.8991 3.8971 4.2675 4.2672 1.0228 1.0260 1.0031 1.0037 1.0166 1.0016 1.0055 1.0054 1.0103 1.0066 1.0017 1.0097 0.9995 0.9992 1.0208 1.0025 1.0010 1.0084 1.0190 1.0084 1.0186 1.0119 1.0088 1.0119 1.0088
dispcorr: -0.023768340 hartree
energy: -1094.876874857757
dipole: 13.95903 -15.03837 -1.07934 -15.38188 14.14478 -1.23710 8.51578 -7.52981 0.98598
magnitude: 1.91508 au
magnitude: 4.86776 debye
