program: Orca
programVersion: 5.0.2
elementType: O O O O N C C C C C C C C C C C C C C C C C C C H H H H H H H H H H H H H H H H H H H H H H H H H
charge: 0
multiplicity: 1
keywords: wb97x-d3
keywords: def2-TZVPP
keywords: def2/J RIJCOSX
keywords: DEFGRID2
keywords: scfconv7
keywords: smallprint printgap noloewdin
keywords: NOSOSCF
formula: C19H25NO4
InChI: InChI=1/C19H25NO4/c1-11(2)9-14-15(19(14,3)4)18(23)24-10-20-16(21)12-7-5-6-8-13(12)17(20)22/h9,14-15H,5-8,10H2,1-4H3
49 atoms
O  0.421894 1.64213 -0.707549
O  0.598032 -0.52572 -1.233581
O  -2.166938 2.594412 0.937081
O  -2.35426 -0.573201 -2.328135
N  -1.890032 1.13427 -0.830121
C  2.655624 -0.547994 1.129335
C  3.392219 -0.458694 -0.171461
C  2.277923 0.518835 0.11517
C  1.758271 -1.734537 1.379928
C  3.339263 -0.044217 2.377057
C  4.790136 0.034119 -0.261593
C  1.031885 0.444547 -0.675119
C  5.875766 -0.739173 -0.218575
C  -0.769771 1.753372 -1.461713
C  7.252693 -0.160299 -0.341053
C  5.819598 -2.227162 -0.051241
C  -3.594969 0.663098 0.643436
C  -3.635987 -0.271083 -0.305182
C  -4.535467 0.7585 1.787984
C  -4.617272 -1.382322 -0.368275
C  -5.751421 -0.131459 1.522405
C  -5.345793 -1.499235 0.972226
C  -2.486759 1.606565 0.336065
C  -2.567417 0.006794 -1.303426
H  3.119249 -1.226169 -0.890833
H  2.576124 1.526845 0.383149
H  2.336713 -2.534118 1.847261
H  1.313777 -2.131338 0.470944
H  0.948634 -1.47469 2.064908
H  2.603166 0.220045 3.138098
H  3.958406 0.832274 2.190597
H  3.988852 -0.816814 2.792932
H  4.926234 1.105156 -0.381673
H  -0.661134 1.31403 -2.453952
H  -0.939361 2.824488 -1.548557
H  7.857447 -0.395327 0.53843
H  7.233234 0.92277 -0.455686
H  7.78015 -0.578835 -1.201912
H  6.402208 -2.538912 0.819302
H  6.259485 -2.733174 -0.91436
H  4.806464 -2.603358 0.07689
H  -4.024346 0.451517 2.706206
H  -4.833022 1.797078 1.948464
H  -5.325928 -1.191625 -1.180856
H  -4.116197 -2.317586 -0.627884
H  -6.329551 -0.251976 2.4398
H  -6.409691 0.36581 0.803913
H  -6.225131 -2.135273 0.860079
H  -4.692664 -1.998324 1.694033
totalener: -1094.85307149 hartree
nucrepener: 2081.80859675 hartree
electener: -3176.66166824 hartree
oneelecener: -5625.74909528 hartree
twoeener: 2449.08742705 hartree
kineticenergy: 1090.09401996 hartree
xcener: -105.970106412905 hartree
chargesum: -0.0000000
charge: -0.263880 -0.375398 -0.316766 -0.299672 -0.122035 0.113245 -0.033249 -0.129159 -0.278154 -0.237937 -0.184680 0.355737 -0.029763 0.081258 -0.212414 -0.233251 -0.097222 -0.085558 -0.076794 -0.075459 -0.136152 -0.135279 0.251912 0.268050 0.107494 0.079564 0.083805 0.106177 0.085941 0.094250 0.080402 0.085441 0.088958 0.127903 0.123646 0.083536 0.079157 0.086683 0.084026 0.093773 0.080964 0.091337 0.093255 0.091890 0.096012 0.078699 0.075114 0.079268 0.075330
qa: -0.2639 -0.3754 -0.3168 -0.2997 -0.1220 0.1132 -0.0332 -0.1292 -0.2782 -0.2379 -0.1847 0.3557 -0.0298 0.0813 -0.2124 -0.2333 -0.0972 -0.0856 -0.0768 -0.0755 -0.1362 -0.1353 0.2519 0.2680 0.1075 0.0796 0.0838 0.1062 0.0859 0.0942 0.0804 0.0854 0.0890 0.1279 0.1236 0.0835 0.0792 0.0867 0.0840 0.0938 0.0810 0.0913 0.0933 0.0919 0.0960 0.0787 0.0751 0.0793 0.0753
va: 2.1324 2.1236 2.1993 2.2137 3.0714 3.6984 3.8114 3.9153 3.9065 3.9052 3.8582 4.2189 3.7392 3.9171 3.9405 3.9417 3.6315 3.6289 3.9256 3.9282 3.8994 3.8986 4.2844 4.2658 1.0234 1.0367 1.0020 1.0210 1.0028 1.0052 1.0080 1.0042 1.0140 1.0155 0.9974 0.9989 1.0108 0.9977 1.0003 1.0012 1.0112 1.0078 1.0197 1.0086 1.0187 1.0117 1.0086 1.0114 1.0083
dispcorr: -0.023259761 hartree
energy: -1094.876331249468
dipole: 21.17049 -21.49545 -0.32496 -13.48854 13.18862 -0.29992 13.30545 -12.47216 0.83329
magnitude: 0.94336 au
magnitude: 2.39782 debye
