program: Orca
programVersion: 5.0.2
elementType: O O O O N C C C C C C C C C C C C C C C C C C C H H H H H H H H H H H H H H H H H H H H H H H H H
charge: 0
multiplicity: 1
keywords: wb97x-d3
keywords: def2-TZVPP
keywords: def2/J RIJCOSX
keywords: DEFGRID2
keywords: scfconv7
keywords: smallprint printgap noloewdin
keywords: NOSOSCF
formula: C19H25NO4
InChI: InChI=1/C19H25NO4/c1-11(2)9-14-15(19(14,3)4)18(23)24-10-20-16(21)12-7-5-6-8-13(12)17(20)22/h9,14-15H,5-8,10H2,1-4H3
49 atoms
O  0.349373 0.355272 0.592214
O  1.848921 0.854628 2.16813
O  -2.372764 2.461985 0.283221
O  -2.100245 -2.018558 1.034187
N  -1.922513 0.2803 0.893268
C  3.585034 1.510543 -0.399883
C  4.038059 0.24779 0.249817
C  2.570902 0.424318 -0.074774
C  3.615071 2.792845 0.394607
C  3.856182 1.712882 -1.871495
C  4.851392 -0.764635 -0.471541
C  1.596718 0.576219 1.024157
C  4.734218 -2.085678 -0.331521
C  -0.684696 0.471432 1.561114
C  5.617342 -3.03233 -1.086525
C  3.731417 -2.731279 0.574967
C  -3.799085 0.626886 -0.392734
C  -3.718674 -0.685001 -0.172586
C  -4.870995 1.297339 -1.169869
C  -4.696506 -1.693004 -0.652538
C  -5.658964 0.251783 -1.961753
C  -5.970299 -0.986566 -1.12077
C  -2.645242 1.294631 0.267389
C  -2.505958 -0.960316 0.643463
H  4.2578 0.347309 1.310562
H  2.19578 -0.121171 -0.933255
H  3.460804 2.634781 1.459391
H  2.851846 3.489815 0.04332
H  4.585063 3.277797 0.269109
H  3.799052 0.783121 -2.437296
H  4.851645 2.134598 -2.026026
H  3.133281 2.408292 -2.300986
H  5.61879 -0.383799 -1.139923
H  -0.674207 1.459285 2.021584
H  -0.571053 -0.286735 2.336429
H  6.31144 -2.510074 -1.744076
H  5.025405 -3.717972 -1.698142
H  6.202688 -3.6524 -0.403186
H  3.175222 -2.016211 1.17686
H  4.224103 -3.427603 1.257961
H  3.010538 -3.319593 0.000716
H  -5.528257 1.841474 -0.483805
H  -4.444088 2.054393 -1.831395
H  -4.249827 -2.270122 -1.468661
H  -4.9133 -2.41679 0.136194
H  -6.583862 0.692838 -2.336179
H  -5.079065 -0.044955 -2.840519
H  -6.589581 -1.680857 -1.690571
H  -6.559058 -0.691411 -0.247347
totalener: -1094.85618432 hartree
nucrepener: 2055.55693472 hartree
electener: -3150.41311904 hartree
oneelecener: -5572.91991240 hartree
twoeener: 2422.50679335 hartree
kineticenergy: 1090.09878133 hartree
xcener: -105.971278398129 hartree
chargesum: 0.0000000
charge: -0.259482 -0.386818 -0.316620 -0.316991 -0.125817 0.127310 -0.016326 -0.102298 -0.260819 -0.273408 -0.241072 0.324611 -0.003437 0.092632 -0.211794 -0.225426 -0.090026 -0.091220 -0.073013 -0.076377 -0.135451 -0.134141 0.261290 0.265846 0.105959 0.085086 0.100458 0.090260 0.083766 0.084751 0.089852 0.092802 0.092460 0.122580 0.122813 0.078527 0.084007 0.087163 0.083303 0.089055 0.090383 0.092448 0.094776 0.093279 0.094225 0.079765 0.076068 0.079701 0.075360
qa: -0.2595 -0.3868 -0.3166 -0.3170 -0.1258 0.1273 -0.0163 -0.1023 -0.2608 -0.2734 -0.2411 0.3246 -0.0034 0.0926 -0.2118 -0.2254 -0.0900 -0.0912 -0.0730 -0.0764 -0.1355 -0.1341 0.2613 0.2658 0.1060 0.0851 0.1005 0.0903 0.0838 0.0848 0.0899 0.0928 0.0925 0.1226 0.1228 0.0785 0.0840 0.0872 0.0833 0.0891 0.0904 0.0924 0.0948 0.0933 0.0942 0.0798 0.0761 0.0797 0.0754
va: 2.1117 2.1111 2.1983 2.1982 3.1154 3.7451 3.8167 3.8414 3.9026 3.9099 3.9002 4.1956 3.7326 3.8995 3.9421 3.9418 3.6257 3.6249 3.9264 3.9279 3.8993 3.8974 4.2770 4.2746 1.0264 1.0301 1.0193 1.0015 1.0023 1.0048 1.0014 1.0063 1.0100 1.0049 1.0023 1.0096 0.9990 0.9989 1.0180 1.0020 1.0006 1.0082 1.0188 1.0083 1.0190 1.0117 1.0085 1.0119 1.0088
dispcorr: -0.022444566 hartree
energy: -1094.878628888386
dipole: 16.51771 -17.57774 -1.06003 -5.34709 4.94171 -0.40538 -12.95846 11.72414 -1.23432
magnitude: 1.67677 au
magnitude: 4.26200 debye
