program: Orca
programVersion: 5.0.2
elementType: O O O O N C C C C C C C C C C C C C C C C C C C H H H H H H H H H H H H H H H H H H H H H H H H H
charge: 0
multiplicity: 1
keywords: wb97x-d3
keywords: def2-TZVPP
keywords: def2/J RIJCOSX
keywords: DEFGRID2
keywords: scfconv7
keywords: smallprint printgap noloewdin
keywords: NOSOSCF
formula: C19H25NO4
InChI: InChI=1/C19H25NO4/c1-11(2)9-14-15(19(14,3)4)18(23)24-10-20-16(21)12-7-5-6-8-13(12)17(20)22/h9,14-15H,5-8,10H2,1-4H3
49 atoms
O  0.322536 0.698603 0.232493
O  1.836497 2.116221 1.055518
O  -2.267095 -0.519742 2.106338
O  -2.219797 1.974218 -1.698616
N  -1.949146 0.947623 0.351647
C  3.646325 0.597844 -1.066993
C  3.995392 0.207712 0.329228
C  2.549871 0.149926 -0.113176
C  3.761761 2.047322 -1.470443
C  3.949119 -0.361424 -2.193664
C  4.735049 -1.042092 0.644636
C  1.577753 1.104127 0.456839
C  4.532442 -1.800113 1.723052
C  -0.71406 1.527833 0.742738
C  5.343043 -3.034968 1.975238
C  3.498976 -1.493494 2.763262
C  -3.722714 -0.508234 0.172076
C  -3.709007 0.222579 -0.942629
C  -4.719471 -1.561344 0.489952
C  -4.676092 0.092435 -2.061154
C  -5.907054 -1.448173 -0.468467
C  -5.456795 -1.215066 -1.911162
C  -2.585962 -0.087084 1.034742
C  -2.564308 1.170089 -0.879052
H  4.208687 1.048725 0.985199
H  2.144553 -0.834883 -0.315567
H  3.57627 2.731287 -0.645626
H  3.060488 2.287664 -2.271625
H  4.76823 2.24474 -1.844418
H  4.974424 -0.230287 -2.546105
H  3.284482 -0.180121 -3.039678
H  3.831733 -1.403728 -1.897321
H  5.518578 -1.333348 -0.049251
H  -0.642818 2.534723 0.331585
H  -0.66558 1.579473 1.830567
H  6.069744 -3.21952 1.184969
H  4.700842 -3.91567 2.055233
H  5.886409 -2.960745 2.920508
H  3.957087 -1.436908 3.753664
H  2.751058 -2.288949 2.813929
H  2.978082 -0.555258 2.586789
H  -4.244373 -2.544154 0.406314
H  -5.042172 -1.478112 1.530087
H  -5.35395 0.952181 -2.056151
H  -4.154578 0.133821 -3.019967
H  -6.518125 -2.349792 -0.406852
H  -6.545837 -0.618518 -0.152049
H  -6.320947 -1.207647 -2.576983
H  -4.825482 -2.048806 -2.23189
totalener: -1094.85603259 hartree
nucrepener: 2058.55839494 hartree
electener: -3153.41442753 hartree
oneelecener: -5578.91691461 hartree
twoeener: 2425.50248708 hartree
kineticenergy: 1090.09655472 hartree
xcener: -105.970546064052 hartree
chargesum: -0.0000000
charge: -0.259762 -0.386067 -0.316822 -0.316695 -0.130763 0.126706 -0.020442 -0.097503 -0.258633 -0.274624 -0.240329 0.322406 -0.002717 0.095396 -0.211427 -0.225273 -0.090257 -0.086139 -0.075218 -0.074704 -0.134967 -0.135008 0.264914 0.260402 0.105492 0.084613 0.099485 0.090265 0.084261 0.090393 0.092935 0.084300 0.092859 0.123376 0.122979 0.078025 0.084461 0.086965 0.088621 0.089583 0.083101 0.093069 0.094462 0.092604 0.094650 0.080024 0.075484 0.079920 0.075599
qa: -0.2598 -0.3861 -0.3168 -0.3167 -0.1308 0.1267 -0.0204 -0.0975 -0.2586 -0.2746 -0.2403 0.3224 -0.0027 0.0954 -0.2114 -0.2253 -0.0903 -0.0861 -0.0752 -0.0747 -0.1350 -0.1350 0.2649 0.2604 0.1055 0.0846 0.0995 0.0903 0.0843 0.0904 0.0929 0.0843 0.0929 0.1234 0.1230 0.0780 0.0845 0.0870 0.0886 0.0896 0.0831 0.0931 0.0945 0.0926 0.0947 0.0800 0.0755 0.0799 0.0756
va: 2.1119 2.1116 2.1982 2.1977 3.1194 3.7480 3.8220 3.8343 3.9009 3.9100 3.8998 4.1986 3.7317 3.8988 3.9422 3.9427 3.6237 3.6225 3.9274 3.9262 3.8972 3.8992 4.2768 4.2788 1.0269 1.0303 1.0194 1.0016 1.0023 1.0014 1.0064 1.0048 1.0098 1.0046 1.0025 1.0098 0.9989 0.9989 1.0019 1.0007 1.0189 1.0086 1.0187 1.0080 1.0191 1.0117 1.0087 1.0117 1.0088
dispcorr: -0.022461210 hartree
energy: -1094.878493802272
dipole: 16.59965 -17.62292 -1.02327 -14.17166 12.97329 -1.19837 -3.88790 3.24396 -0.64394
magnitude: 1.70230 au
magnitude: 4.32691 debye
