program: Orca
programVersion: 5.0.3
elementType: Cl F F F F F F F O O C C C C C C C C C C C C C C C C C H H H H H H H H H H H H H H
charge: 0
multiplicity: 1
keywords: wb97x-d3
keywords: def2-TZVPP
keywords: def2/J RIJCOSX
keywords: DEFGRID2
keywords: scfconv7
keywords: smallprint printgap noloewdin
keywords: NOSOSCF
formula: C17H14ClF7O2
InChI: InChI=1/C17H14ClF7O2/c1-6-11(19)13(21)7(14(22)12(6)20)5-27-15(26)10-8(16(10,2)3)4-9(18)17(23,24)25/h4,8,10H,5H2,1-3H3
41 atoms
Cl -4.90351 2.213809 0.522329
F  -4.288461 3.380522 -2.178879
F  -5.855122 1.921715 -2.328051
F  -3.917965 1.502531 -3.164605
F  2.953048 1.601417 0.334008
F  3.463869 -3.047651 -0.071323
F  5.667898 -2.932714 1.420646
F  5.161279 1.71921 1.821268
O  0.803395 -0.77893 0.15586
O  -0.619567 -0.792144 -1.558428
C  -2.682436 -1.62322 0.671158
C  -2.808283 -0.129158 0.538644
C  -1.43524 -0.771372 0.706681
C  -2.995095 -2.527126 -0.494598
C  -3.097344 -2.21159 1.998029
C  -3.231245 0.488364 -0.717254
C  -0.421047 -0.782492 -0.366936
C  -4.113732 1.47487 -0.826232
C  1.905082 -0.765325 -0.759347
C  -4.540288 2.067811 -2.130885
C  3.149274 -0.721085 0.06923
C  3.616766 0.473976 0.589599
C  3.86915 -1.86147 0.382536
C  5.013967 -1.800543 1.153096
C  4.762798 0.532383 1.35829
C  5.499249 -0.603578 1.654438
C  6.741626 -0.558372 2.486615
H  -3.138972 0.380775 1.4355
H  -1.013582 -0.630295 1.694528
H  -4.069181 -2.7193 -0.525553
H  -2.706174 -2.133911 -1.464883
H  -2.493871 -3.488049 -0.367355
H  -2.57021 -3.148889 2.186071
H  -2.887553 -1.538122 2.829787
H  -4.168044 -2.424279 2.002804
H  -2.812118 0.110566 -1.639222
H  1.845512 0.105344 -1.413891
H  1.885314 -1.651648 -1.393843
H  7.488595 -1.259875 2.119583
H  7.192276 0.430945 2.483229
H  6.523315 -0.820642 3.523137
elementType: Cl F O C H
totalener: -1965.99365892 hartree
nucrepener: 2688.14758642 hartree
electener: -4654.14124534 hartree
oneelecener: -8056.18523270 hartree
twoeener: 3402.04398736 hartree
cpcmener: -0.01943400 hartree
kineticenergy: 1959.81207817 hartree
xcener: -152.598446659406 hartree
chargesum: -0.0000000
charge: -0.074392 -0.174181 -0.174241 -0.170836 -0.203280 -0.203456 -0.206303 -0.206451 -0.269993 -0.466986 0.079330 0.039392 -0.087751 -0.266100 -0.251786 -0.167840 0.413751 -0.086057 0.064943 0.510332 -0.229577 0.264050 0.274872 0.215034 0.222321 -0.135978 -0.209878 0.094279 0.101702 0.102472 0.096090 0.101977 0.096679 0.089929 0.096682 0.151098 0.123678 0.119313 0.107277 0.103984 0.115902
qa: -0.0744 -0.1742 -0.1742 -0.1708 -0.2033 -0.2035 -0.2063 -0.2065 -0.2700 -0.4670 0.0793 0.0394 -0.0878 -0.2661 -0.2518 -0.1678 0.4138 -0.0861 0.0649 0.5103 -0.2296 0.2640 0.2749 0.2150 0.2223 -0.1360 -0.2099 0.0943 0.1017 0.1025 0.0961 0.1020 0.0967 0.0899 0.0967 0.1511 0.1237 0.1193 0.1073 0.1040 0.1159
va: 1.2607 1.1254 1.1234 1.1324 1.0980 1.0985 1.0927 1.0913 2.1422 2.0283 3.7823 3.7586 3.9459 3.9019 3.9106 3.8448 4.0845 4.0105 3.8352 4.4831 3.7511 3.9107 3.8829 3.9365 3.9158 3.7341 3.9150 1.0276 1.0271 1.0004 1.0145 0.9994 1.0023 1.0054 1.0020 1.0306 1.0019 1.0081 1.0026 1.0086 0.9953
dispcorr: -0.018491264 hartree
energy: -1966.012150180650
dipole: 2.77168 -1.31130 1.46037 -24.47685 23.13975 -1.33710 13.84494 -12.17124 1.67370
magnitude: 2.59265 au
magnitude: 6.58999 debye
