program: Orca
programVersion: 5.0.3
elementType: Cl F F F F F F F O O C C C C C C C C C C C C C C C C C H H H H H H H H H H H H H H
charge: 0
multiplicity: 1
keywords: wb97x-d3
keywords: def2-TZVPP
keywords: def2/J RIJCOSX
keywords: DEFGRID2
keywords: scfconv7
keywords: smallprint printgap noloewdin
keywords: NOSOSCF
formula: C17H14ClF7O2
InChI: InChI=1/C17H14ClF7O2/c1-6-11(19)13(21)7(14(22)12(6)20)5-27-15(26)10-8(16(10,2)3)4-9(18)17(23,24)25/h4,8,10H,5H2,1-3H3
41 atoms
Cl -5.253342 0.989098 0.625172
F  -2.447975 3.489071 -0.334945
F  -3.954144 3.643838 1.197249
F  -4.533468 3.478357 -0.86194
F  3.128652 0.941707 1.808966
F  2.390314 -3.345927 0.028593
F  3.905889 -2.723599 -2.076306
F  4.653594 1.54618 -0.262342
O  0.496598 -1.927699 1.700908
O  0.102589 0.191326 1.119087
C  -1.81939 -1.571251 -0.798206
C  -2.656844 -0.696933 0.102908
C  -1.526717 -1.526021 0.683349
C  -0.856067 -0.961468 -1.787187
C  -2.471308 -2.833087 -1.304835
C  -2.629151 0.763446 0.000355
C  -0.255533 -0.957977 1.179165
C  -3.681109 1.556469 0.178385
C  1.811139 -1.585063 2.141117
C  -3.646237 3.044629 0.041066
C  2.702355 -1.22349 0.98796
C  3.304739 0.015423 0.866714
C  2.937499 -2.130911 -0.033779
C  3.727272 -1.810834 -1.117731
C  4.106488 0.32873 -0.216624
C  4.340524 -0.573091 -1.240301
C  5.196175 -0.255595 -2.425612
H  -3.628573 -1.110293 0.345496
H  -1.853048 -2.398574 1.238323
H  -0.09804 -1.695759 -2.065562
H  -1.386961 -0.676986 -2.697134
H  -0.333643 -0.079334 -1.424336
H  -3.167635 -3.253486 -0.578554
H  -3.025539 -2.636068 -2.224318
H  -1.71964 -3.593305 -1.525117
H  -1.699605 1.243724 -0.270782
H  2.179005 -2.478057 2.643999
H  1.774162 -0.786201 2.88095
H  4.596773 -0.200449 -3.335131
H  5.708706 0.695524 -2.310607
H  5.955922 -1.021804 -2.577866
elementType: Cl F O C H
totalener: -1965.99228789 hartree
nucrepener: 2810.55844025 hartree
electener: -4776.55072815 hartree
oneelecener: -8301.46331521 hartree
twoeener: 3524.91258706 hartree
cpcmener: -0.02150325 hartree
kineticenergy: 1959.80044433 hartree
xcener: -152.597579751964 hartree
chargesum: -0.0000000
charge: -0.076206 -0.171006 -0.174309 -0.174990 -0.205027 -0.204485 -0.208105 -0.208302 -0.272640 -0.449170 0.084401 0.024138 -0.071962 -0.275832 -0.254265 -0.153992 0.387596 -0.083214 0.058990 0.510325 -0.182832 0.283341 0.205428 0.222530 0.237565 -0.156686 -0.206784 0.092704 0.107849 0.101310 0.109685 0.095432 0.089653 0.097264 0.096018 0.139880 0.140387 0.121236 0.114136 0.099187 0.110750
qa: -0.0762 -0.1710 -0.1743 -0.1750 -0.2050 -0.2045 -0.2081 -0.2083 -0.2726 -0.4492 0.0844 0.0241 -0.0720 -0.2758 -0.2543 -0.1540 0.3876 -0.0832 0.0590 0.5103 -0.1828 0.2833 0.2054 0.2225 0.2376 -0.1567 -0.2068 0.0927 0.1078 0.1013 0.1097 0.0954 0.0897 0.0973 0.0960 0.1399 0.1404 0.1212 0.1141 0.0992 0.1108
va: 1.2589 1.1329 1.1234 1.1238 1.0930 1.0915 1.0914 1.0893 2.1312 2.0542 3.8003 3.7887 3.8535 3.9035 3.9025 3.8594 4.1664 3.9991 3.8491 4.4859 3.6237 3.8701 3.9343 3.9265 3.8968 3.7386 3.9143 1.0301 1.0262 0.9990 1.0007 1.0137 1.0055 1.0013 1.0026 1.0295 0.9920 1.0182 0.9962 1.0135 0.9984
dispcorr: -0.020713980 hartree
energy: -1966.013001874632
dipole: 7.37982 -6.26391 1.11591 -24.71441 22.44452 -2.26989 -11.66178 11.08264 -0.57913
magnitude: 2.59482 au
magnitude: 6.59550 debye
