program: Orca
programVersion: 5.0.3
elementType: Cl F F F F F F F O O C C C C C C C C C C C C C C C C C H H H H H H H H H H H H H H
charge: 0
multiplicity: 1
keywords: wb97x-d3
keywords: def2-TZVPP
keywords: def2/J RIJCOSX
keywords: DEFGRID2
keywords: scfconv7
keywords: smallprint printgap noloewdin
keywords: NOSOSCF
formula: C17H14ClF7O2
InChI: InChI=1/C17H14ClF7O2/c1-6-11(19)13(21)7(14(22)12(6)20)5-27-15(26)10-8(16(10,2)3)4-9(18)17(23,24)25/h4,8,10H,5H2,1-3H3
41 atoms
Cl -5.298259 0.931733 0.67298
F  -2.549227 3.493313 -0.286605
F  -4.062683 3.603368 1.243095
F  -4.633354 3.449863 -0.819763
F  3.178971 1.023061 1.71888
F  2.386197 -3.325848 0.114901
F  3.964419 -2.854855 -1.96194
F  4.786673 1.480069 -0.342154
O  0.500688 -1.834515 1.696812
O  0.111176 0.246109 0.988168
C  -1.846857 -1.552504 -0.829378
C  -2.678376 -0.695785 0.091067
C  -1.51461 -1.498219 0.643966
C  -0.924822 -0.925803 -1.846781
C  -2.486122 -2.82984 -1.313458
C  -2.682588 0.764667 -0.005004
C  -0.247274 -0.898477 1.112277
C  -3.746093 1.534018 0.203265
C  1.806346 -1.466142 2.138974
C  -3.740738 3.023582 0.081362
C  2.722937 -1.171334 0.986461
C  3.358377 0.048947 0.826461
C  2.962772 -2.12724 0.013544
C  3.790319 -1.880431 -1.064738
C  4.195576 0.286528 -0.244942
C  4.434661 -0.664724 -1.224295
C  5.341364 -0.364193 -2.375973
H  -3.633819 -1.129506 0.361037
H  -1.808427 -2.374782 1.210311
H  -0.420329 -0.025035 -1.505347
H  -0.152036 -1.640742 -2.135163
H  -1.485355 -0.666774 -2.746569
H  -3.149964 -3.263937 -0.564942
H  -3.07387 -2.646217 -2.214881
H  -1.725563 -3.574155 -1.556742
H  -1.768327 1.265465 -0.290115
H  2.164055 -2.329376 2.698223
H  1.756687 -0.626988 2.83194
H  4.94708 0.454816 -2.978414
H  6.331098 -0.069158 -2.027117
H  5.465212 -1.223681 -3.028742
elementType: Cl F O C H
totalener: -1965.99238681 hartree
nucrepener: 2801.60644159 hartree
electener: -4767.59882840 hartree
oneelecener: -8283.57969302 hartree
twoeener: 3515.98086462 hartree
cpcmener: -0.02125136 hartree
kineticenergy: 1959.80238164 hartree
xcener: -152.598117328730 hartree
chargesum: 0.0000000
charge: -0.075870 -0.171154 -0.174033 -0.174803 -0.205140 -0.204005 -0.209012 -0.206886 -0.273483 -0.452534 0.082313 0.025544 -0.073998 -0.272600 -0.254006 -0.153761 0.394659 -0.083773 0.060160 0.510147 -0.184277 0.285412 0.209079 0.241644 0.211296 -0.157510 -0.205011 0.092856 0.106165 0.095810 0.100379 0.107830 0.089837 0.097257 0.095936 0.140796 0.139761 0.121324 0.113461 0.111650 0.098538
qa: -0.0759 -0.1712 -0.1740 -0.1748 -0.2051 -0.2040 -0.2090 -0.2069 -0.2735 -0.4525 0.0823 0.0255 -0.0740 -0.2726 -0.2540 -0.1538 0.3947 -0.0838 0.0602 0.5101 -0.1843 0.2854 0.2091 0.2416 0.2113 -0.1575 -0.2050 0.0929 0.1062 0.0958 0.1004 0.1078 0.0898 0.0973 0.0959 0.1408 0.1398 0.1213 0.1135 0.1116 0.0985
va: 1.2594 1.1326 1.1241 1.1239 1.0929 1.0922 1.0877 1.0938 2.1310 2.0504 3.8007 3.7863 3.8606 3.9036 3.9038 3.8571 4.1519 4.0005 3.8521 4.4857 3.6257 3.8469 3.9599 3.8717 3.9530 3.7349 3.9146 1.0299 1.0271 1.0144 0.9996 1.0006 1.0054 1.0014 1.0025 1.0307 0.9918 1.0181 0.9970 0.9976 1.0139
dispcorr: -0.020457381 hartree
energy: -1966.012844189274
dipole: 7.65111 -6.52031 1.13080 -24.32127 22.10239 -2.21889 -11.95001 11.42840 -0.52161
magnitude: 2.54445 au
magnitude: 6.46749 debye
