program: Orca
programVersion: 5.0.3
elementType: Cl F F F F F F F O O C C C C C C C C C C C C C C C C C H H H H H H H H H H H H H H
charge: 0
multiplicity: 1
keywords: wb97x-d3
keywords: def2-TZVPP
keywords: def2/J RIJCOSX
keywords: DEFGRID2
keywords: scfconv7
keywords: smallprint printgap noloewdin
keywords: NOSOSCF
formula: C17H14ClF7O2
InChI: InChI=1/C17H14ClF7O2/c1-6-11(19)13(21)7(14(22)12(6)20)5-27-15(26)10-8(16(10,2)3)4-9(18)17(23,24)25/h4,8,10H,5H2,1-3H3
41 atoms
Cl -5.504663 -1.115029 0.797458
F  -5.561355 1.663977 1.986065
F  -6.482806 1.614513 0.047741
F  -4.599589 2.626385 0.317441
F  3.481938 -1.143231 2.611871
F  2.995415 1.261931 -1.39039
F  5.40519 0.450684 -2.1789
F  5.901881 -1.961544 1.817125
O  0.856942 -0.397778 0.6039
O  -0.552522 1.213245 -0.054888
C  -1.79695 -1.161965 -1.697583
C  -2.638278 -1.003208 -0.462143
C  -1.12155 -1.101544 -0.346721
C  -1.658289 -0.036746 -2.692917
C  -1.818563 -2.525197 -2.348898
C  -3.368328 0.231275 -0.160085
C  -0.283728 0.047684 0.065778
C  -4.584836 0.28172 0.370283
C  1.811336 0.558767 1.064914
C  -5.308723 1.557425 0.679891
C  3.172608 0.100198 0.641297
C  3.943304 -0.739617 1.430644
C  3.699717 0.470603 -0.584793
C  4.950647 0.044823 -0.994033
C  5.191835 -1.163893 1.019968
C  5.72764 -0.785181 -0.201906
C  7.083968 -1.264795 -0.618646
H  -3.14099 -1.906144 -0.136512
H  -0.761594 -2.050925 0.031714
H  -2.497408 -0.05975 -3.389531
H  -1.62274 0.952069 -2.246099
H  -0.743671 -0.164706 -3.273992
H  -0.895478 -2.70335 -2.902822
H  -1.928083 -3.327957 -1.619067
H  -2.650171 -2.600577 -3.05108
H  -2.887637 1.174446 -0.376329
H  1.74117 0.617174 2.151172
H  1.594066 1.548082 0.665749
H  7.117837 -2.353539 -0.653413
H  7.357414 -0.891179 -1.600692
H  7.846646 -0.937993 0.087981
totalener: -1965.97823877 hartree
nucrepener: 2698.97015169 hartree
electener: -4664.94839046 hartree
oneelecener: -8077.83978454 hartree
twoeener: 3412.89139408 hartree
kineticenergy: 1959.83466337 hartree
xcener: -152.600096331878 hartree
chargesum: 0.0000000
charge: -0.062450 -0.162408 -0.163069 -0.165784 -0.186353 -0.185834 -0.189781 -0.187252 -0.262731 -0.395091 0.055591 0.053603 -0.105111 -0.251402 -0.231833 -0.187908 0.381902 -0.082100 0.039621 0.505314 -0.207585 0.244975 0.267348 0.224693 0.202093 -0.167423 -0.197926 0.078899 0.089911 0.095827 0.102282 0.091648 0.091385 0.075008 0.094388 0.149923 0.109564 0.126099 0.105831 0.100843 0.105293
qa: -0.0624 -0.1624 -0.1631 -0.1658 -0.1864 -0.1858 -0.1898 -0.1873 -0.2627 -0.3951 0.0556 0.0536 -0.1051 -0.2514 -0.2318 -0.1879 0.3819 -0.0821 0.0396 0.5053 -0.2076 0.2450 0.2673 0.2247 0.2021 -0.1674 -0.1979 0.0789 0.0899 0.0958 0.1023 0.0916 0.0914 0.0750 0.0944 0.1499 0.1096 0.1261 0.1058 0.1008 0.1053
va: 1.2750 1.1420 1.1412 1.1390 1.1194 1.1169 1.1116 1.1180 2.1376 2.0930 3.8012 3.7284 3.9133 3.9129 3.9128 3.8822 4.1397 4.0441 3.8499 4.4863 3.7422 3.9247 3.8822 3.9199 3.9495 3.7503 3.9200 1.0389 1.0303 1.0011 1.0187 1.0022 1.0044 1.0085 1.0038 1.0331 1.0006 1.0218 0.9995 1.0147 0.9998
dispcorr: -0.018661682 hartree
energy: -1965.996900448154
dipole: 14.38718 -12.72483 1.66235 -14.18996 13.06985 -1.12011 -19.64169 18.98234 -0.65935
magnitude: 2.11016 au
magnitude: 5.36361 debye
