program: Orca
programVersion: 5.0.3
elementType: Cl F F F F F F F O O C C C C C C C C C C C C C C C C C H H H H H H H H H H H H H H
charge: 0
multiplicity: 1
keywords: wb97x-d3
keywords: def2-TZVPP
keywords: def2/J RIJCOSX
keywords: DEFGRID2
keywords: scfconv7
keywords: smallprint printgap noloewdin
keywords: NOSOSCF
formula: C17H14ClF7O2
InChI: InChI=1/C17H14ClF7O2/c1-6-11(19)13(21)7(14(22)12(6)20)5-27-15(26)10-8(16(10,2)3)4-9(18)17(23,24)25/h4,8,10H,5H2,1-3H3
41 atoms
Cl -1.6556 1.147305 1.360261
F  -0.10367 2.395196 -0.918972
F  -2.0648 3.258259 -0.769518
F  -1.578802 1.97825 -2.430774
F  3.212821 -1.387523 -1.347445
F  0.926406 -0.644677 2.689737
F  1.45664 1.965231 2.498323
F  3.795872 1.193899 -1.497284
O  0.263533 -2.74641 0.894653
O  -0.106519 -1.920942 -1.149351
C  -3.089625 -2.625948 -0.663689
C  -2.873529 -1.270385 -0.080375
C  -1.94548 -2.420915 0.303732
C  -2.850196 -2.883453 -2.131278
C  -4.251935 -3.419198 -0.110799
C  -2.372174 -0.134483 -0.876392
C  -0.526103 -2.333027 -0.101716
C  -1.864901 0.966254 -0.338787
C  1.663764 -2.553361 0.736425
C  -1.401372 2.155279 -1.122876
C  2.029565 -1.097281 0.663005
C  2.765646 -0.580338 -0.388384
C  1.614701 -0.203232 1.639347
C  1.899368 1.143539 1.547056
C  3.070432 0.767177 -0.463422
C  2.637271 1.665909 0.496264
C  2.938137 3.13132 0.432313
H  -3.537828 -0.975843 0.726611
H  -2.093516 -2.814031 1.302241
H  -2.665134 -3.945226 -2.299273
H  -3.742233 -2.613906 -2.699832
H  -2.004944 -2.340431 -2.543256
H  -4.421692 -3.217056 0.947461
H  -5.171197 -3.175069 -0.645533
H  -4.077006 -4.490473 -0.219625
H  -2.440978 -0.186663 -1.954862
H  2.030442 -3.083115 -0.142503
H  2.106209 -3.017704 1.617063
H  3.547274 3.441438 1.281369
H  3.474357 3.390783 -0.475526
H  2.019658 3.716214 0.457308
totalener: -1965.97405629 hartree
nucrepener: 3059.97761215 hartree
electener: -5025.95166843 hartree
oneelecener: -8800.80368202 hartree
twoeener: 3774.85201358 hartree
kineticenergy: 1959.86189174 hartree
xcener: -152.606155706856 hartree
chargesum: -0.0000000
charge: -0.052926 -0.159199 -0.162312 -0.165548 -0.192049 -0.184894 -0.189947 -0.193349 -0.258602 -0.379857 0.107040 -0.093324 -0.067465 -0.277332 -0.233193 -0.069713 0.335947 -0.083069 0.057963 0.505555 -0.180230 0.295348 0.173768 0.186613 0.241709 -0.173093 -0.199454 0.102705 0.086682 0.088895 0.095274 0.104790 0.075068 0.091639 0.094388 0.128170 0.116631 0.117840 0.104683 0.098895 0.105953
qa: -0.0529 -0.1592 -0.1623 -0.1655 -0.1920 -0.1849 -0.1899 -0.1933 -0.2586 -0.3799 0.1070 -0.0933 -0.0675 -0.2773 -0.2332 -0.0697 0.3359 -0.0831 0.0580 0.5056 -0.1802 0.2953 0.1738 0.1866 0.2417 -0.1731 -0.1995 0.1027 0.0867 0.0889 0.0953 0.1048 0.0751 0.0916 0.0944 0.1282 0.1166 0.1178 0.1047 0.0989 0.1060
va: 1.2924 1.1298 1.1441 1.1412 1.1117 1.1104 1.1100 1.1096 2.1351 2.1032 3.7750 3.8826 3.8628 3.9038 3.9003 3.7987 4.1509 4.0066 3.8819 4.4616 3.6483 3.8687 3.9405 3.9242 3.9055 3.7023 3.9190 1.0156 1.0329 1.0046 0.9978 1.0205 1.0074 1.0045 1.0047 1.0172 1.0186 0.9908 0.9992 1.0145 1.0047
dispcorr: -0.024530137 hartree
energy: -1965.998586424656
dipole: -18.97353 18.30791 -0.66562 -27.79699 26.79086 -1.00613 -4.54766 4.91284 0.36518
magnitude: 1.26044 au
magnitude: 3.20377 debye
