program: Orca
programVersion: 5.0.2
elementType: Si F O O C C C C C C C C C C C C C C C C C C C C C C C C C H H H H H H H H H H H H H H H H H H H H H H H H H H H H H
charge: 0
multiplicity: 1
keywords: wb97x-d3
keywords: def2-TZVPP
keywords: def2/J RIJCOSX
keywords: DEFGRID2
keywords: scfconv7
keywords: smallprint printgap noloewdin
keywords: NOSOSCF
formula: C25H29FO2Si
InChI: InChI=1/C25H29FO2Si/c1-4-27-21-13-15-23(16-14-21)29(2,3)18-8-9-20-12-17-24(26)25(19-20)28-22-10-6-5-7-11-22/h5-7,10-17,19H,4,8-9,18H2,1-3H3
58 atoms
Si -4.276626 1.466867 0.647766
F  2.231198 -3.748117 -0.850448
O  1.704895 2.34654 1.007029
O  1.849776 -1.399021 0.536257
C  -4.606717 -0.395526 0.894188
C  -3.397121 -1.314013 0.721299
C  -2.425493 1.809063 0.743497
C  -5.1479 2.415327 2.021363
C  -4.917271 2.028997 -1.029786
C  -2.857065 -1.357713 -0.709842
C  -1.714186 1.661056 1.941122
C  -1.684928 2.159729 -0.383478
C  -1.503034 -2.005846 -0.790536
C  -0.344775 1.844519 2.00744
C  -0.307846 2.350767 -0.34398
C  0.373045 2.189191 0.859191
C  -0.416662 -1.397477 -0.161478
C  -1.292718 -3.204681 -1.460634
C  0.83669 -1.977912 -0.178199
C  -0.033726 -3.794835 -1.496176
C  1.014819 -3.182702 -0.848244
C  2.475641 2.73243 -0.126993
C  3.907263 2.908083 0.312717
C  3.022133 -1.059935 -0.090701
C  4.149541 -0.986431 0.71695
C  3.098458 -0.768679 -1.445552
C  5.36477 -0.619747 0.160012
C  4.324832 -0.407537 -1.988859
C  5.460905 -0.332578 -1.195644
H  -5.011187 -0.530663 1.902264
H  -5.410454 -0.701146 0.214909
H  -3.650731 -2.333288 1.027719
H  -2.602041 -0.989429 1.397457
H  -6.218348 2.198812 2.033754
H  -4.752692 2.147157 3.00361
H  -5.032411 3.494424 1.904352
H  -5.998031 1.884217 -1.091612
H  -4.720932 3.087367 -1.211211
H  -4.471321 1.463037 -1.850355
H  -3.563221 -1.886954 -1.353612
H  -2.782243 -0.341959 -1.109507
H  -2.234908 1.391167 2.85369
H  -2.18016 2.286686 -1.339389
H  0.180078 1.719974 2.946961
H  0.209022 2.616422 -1.25598
H  -0.546408 -0.461726 0.369678
H  -2.118315 -3.695241 -1.960484
H  0.126381 -4.732734 -2.012277
H  2.089498 3.667871 -0.544147
H  2.405797 1.967069 -0.906196
H  4.005391 3.708342 1.046686
H  4.312911 1.991287 0.740353
H  4.517537 3.170796 -0.550869
H  4.072823 -1.215287 1.772379
H  2.221064 -0.810495 -2.078867
H  6.241434 -0.56416 0.791864
H  4.385397 -0.182967 -3.045642
H  6.411391 -0.051793 -1.628801
elementType: Si F O C H
totalener: -1510.05287682 hartree
nucrepener: 2976.64739377 hartree
electener: -4486.70027059 hartree
oneelecener: -7984.09890690 hartree
twoeener: 3497.39863631 hartree
cpcmener: -0.02639826 hartree
kineticenergy: 1503.91275214 hartree
xcener: -135.234536452659 hartree
chargesum: -0.0000000
charge: 0.494666 -0.219918 -0.341377 -0.334330 -0.294208 -0.110367 -0.110900 -0.457231 -0.433515 -0.110230 -0.140927 -0.183320 0.007852 -0.255589 -0.231835 0.330679 -0.152083 -0.148056 0.090243 -0.185644 0.281086 0.031011 -0.305624 0.309504 -0.263605 -0.202772 -0.124926 -0.140029 -0.191573 0.100030 0.085699 0.091855 0.080852 0.103552 0.101381 0.100784 0.110375 0.107923 0.103509 0.096237 0.090060 0.138510 0.149178 0.132728 0.138145 0.074721 0.141678 0.149641 0.124593 0.106975 0.102063 0.087556 0.096504 0.144264 0.154413 0.158785 0.161870 0.159137
qa: 0.4947 -0.2199 -0.3414 -0.3343 -0.2942 -0.1104 -0.1109 -0.4572 -0.4335 -0.1102 -0.1409 -0.1833 0.0079 -0.2556 -0.2318 0.3307 -0.1521 -0.1481 0.0902 -0.1856 0.2811 0.0310 -0.3056 0.3095 -0.2636 -0.2028 -0.1249 -0.1400 -0.1916 0.1000 0.0857 0.0919 0.0809 0.1036 0.1014 0.1008 0.1104 0.1079 0.1035 0.0962 0.0901 0.1385 0.1492 0.1327 0.1381 0.0747 0.1417 0.1496 0.1246 0.1070 0.1021 0.0876 0.0965 0.1443 0.1544 0.1588 0.1619 0.1591
va: 4.0594 1.0638 2.0355 2.0358 3.8703 3.8417 3.6735 3.9006 3.8990 3.7614 3.8644 3.8789 3.6494 3.9998 3.8566 3.7027 3.8544 3.8752 3.8332 3.9305 3.9401 3.7613 3.9610 3.5431 3.9794 3.8385 3.8461 3.8720 3.8692 1.0064 1.0095 1.0078 1.0076 1.0093 1.0111 1.0113 1.0101 1.0078 1.0094 1.0148 1.0177 0.9923 0.9888 1.0151 1.0134 1.0370 1.0032 0.9990 0.9926 0.9763 1.0079 1.0019 1.0035 1.0112 1.0031 0.9893 0.9890 0.9904
dispcorr: -0.034587647 hartree
energy: -1510.087464465993
dipole: -20.60702 19.93797 -0.66905 20.88310 -20.41383 0.46927 0.55982 -1.78645 -1.22664
magnitude: 1.47394 au
magnitude: 3.74645 debye
