program: Orca
programVersion: 5.0.2
elementType: Si F O O C C C C C C C C C C C C C C C C C C C C C C C C C H H H H H H H H H H H H H H H H H H H H H H H H H H H H H
charge: 0
multiplicity: 1
keywords: wb97x-d3
keywords: def2-TZVPP
keywords: def2/J RIJCOSX
keywords: DEFGRID2
keywords: scfconv7
keywords: smallprint printgap noloewdin
keywords: NOSOSCF
formula: C25H29FO2Si
InChI: InChI=1/C25H29FO2Si/c1-4-27-21-13-15-23(16-14-21)29(2,3)18-8-9-20-12-17-24(26)25(19-20)28-22-10-6-5-7-11-22/h5-7,10-17,19H,4,8-9,18H2,1-3H3
58 atoms
Si -3.463155 1.297253 0.967691
F  1.849904 -3.837217 0.147575
O  2.000896 2.831349 -1.148057
O  1.578628 -1.486609 -1.292511
C  -3.634989 -0.515967 0.46666
C  -3.61106 -0.716711 -1.048909
C  -1.772868 1.868933 0.364829
C  -3.551559 1.464483 2.838906
C  -4.80386 2.324637 0.141326
C  -3.263197 -2.141887 -1.477074
C  -1.559325 2.274749 -0.958171
C  -0.650651 1.827707 1.190949
C  -1.89805 -2.581872 -1.020041
C  -0.300654 2.597237 -1.433704
C  0.62224 2.158721 0.740791
C  0.807893 2.533019 -0.587705
C  -0.767818 -1.813166 -1.30198
C  -1.732426 -3.758253 -0.298586
C  0.492866 -2.223712 -0.905379
C  -0.473897 -4.182423 0.107698
C  0.627145 -3.421635 -0.211312
C  3.165467 2.922456 -0.330542
C  3.226493 4.209906 0.461829
C  2.506926 -1.07408 -0.368301
C  2.216253 -0.906423 0.978234
C  3.775177 -0.794454 -0.861187
C  3.220279 -0.476297 1.836632
C  4.764571 -0.360832 0.007814
C  4.4964 -0.207295 1.362011
H  -2.801465 -1.052402 0.935092
H  -4.544811 -0.95341 0.890195
H  -2.894842 -0.036362 -1.518616
H  -4.582789 -0.449161 -1.470591
H  -4.53915 1.177794 3.206823
H  -2.824174 0.824124 3.341543
H  -3.368127 2.490052 3.164765
H  -4.759338 2.258742 -0.947674
H  -5.797117 1.98646 0.444447
H  -4.722357 3.380205 0.408139
H  -4.010113 -2.838167 -1.088562
H  -3.317208 -2.207782 -2.567919
H  -2.39325 2.34424 -1.647707
H  -0.749311 1.529779 2.228925
H  -0.170031 2.900175 -2.465564
H  1.44765 2.109932 1.437405
H  -0.85447 -0.883845 -1.853639
H  -2.595446 -4.364037 -0.05344
H  -0.348345 -5.105863 0.658203
H  3.999843 2.875906 -1.030034
H  3.250193 2.050826 0.32283
H  4.169258 4.248163 1.008671
H  3.187015 5.079499 -0.194506
H  2.420319 4.292612 1.190839
H  1.223182 -1.09497 1.366416
H  3.985274 -0.921349 -1.915684
H  2.99374 -0.347104 2.886906
H  5.75195 -0.147302 -0.38024
H  5.271985 0.126427 2.038121
elementType: Si F O C H
totalener: -1510.05170342 hartree
nucrepener: 3005.95109739 hartree
electener: -4516.00280082 hartree
oneelecener: -8042.96506873 hartree
twoeener: 3526.96226791 hartree
cpcmener: -0.02704157 hartree
kineticenergy: 1503.91851557 hartree
xcener: -135.237022679394 hartree
chargesum: 0.0000000
charge: 0.491137 -0.218997 -0.355826 -0.336165 -0.243604 -0.132261 -0.124241 -0.460782 -0.428904 -0.100107 -0.146098 -0.168570 -0.018530 -0.289458 -0.241696 0.332294 -0.255547 -0.150142 0.188607 -0.177954 0.255615 0.119478 -0.274828 0.293741 -0.165008 -0.240520 -0.181163 -0.152527 -0.152569 0.079053 0.088368 0.076315 0.093128 0.107107 0.100769 0.106961 0.102647 0.107245 0.108387 0.081159 0.097375 0.148014 0.141747 0.133360 0.146904 0.138168 0.143463 0.150458 0.115048 0.014467 0.095412 0.093118 0.092152 0.153266 0.145292 0.160088 0.157532 0.157620
qa: 0.4911 -0.2190 -0.3558 -0.3362 -0.2436 -0.1323 -0.1242 -0.4608 -0.4289 -0.1001 -0.1461 -0.1686 -0.0185 -0.2895 -0.2417 0.3323 -0.2555 -0.1501 0.1886 -0.1780 0.2556 0.1195 -0.2748 0.2937 -0.1650 -0.2405 -0.1812 -0.1525 -0.1526 0.0791 0.0884 0.0763 0.0931 0.1071 0.1008 0.1070 0.1026 0.1072 0.1084 0.0812 0.0974 0.1480 0.1417 0.1334 0.1469 0.1382 0.1435 0.1505 0.1150 0.0145 0.0954 0.0931 0.0922 0.1533 0.1453 0.1601 0.1575 0.1576
va: 4.1386 1.0640 2.0366 2.0419 3.8181 3.8784 3.6760 3.9235 3.8915 3.8541 3.8756 3.8795 3.6980 4.0666 3.8368 3.6879 3.9485 3.8675 3.7095 3.9223 3.9430 3.8278 3.9555 3.5862 3.7922 3.9456 3.8764 3.8800 3.8106 1.0141 1.0126 1.0029 1.0079 1.0108 1.0103 1.0097 1.0089 1.0073 1.0083 1.0084 1.0018 0.9823 0.9908 1.0153 0.9947 1.0124 1.0008 0.9986 0.9913 1.0186 1.0077 1.0064 1.0000 1.0045 1.0096 0.9916 0.9907 0.9904
dispcorr: -0.034933459 hartree
energy: -1510.086636883021
dipole: -17.96686 17.43369 -0.53317 22.06176 -21.93778 0.12398 7.92242 -6.99286 0.92956
magnitude: 1.07876 au
magnitude: 2.74199 debye
