program: Orca
programVersion: 5.0.2
elementType: Si F O O C C C C C C C C C C C C C C C C C C C C C C C C C H H H H H H H H H H H H H H H H H H H H H H H H H H H H H
charge: 0
multiplicity: 1
keywords: wb97x-d3
keywords: def2-TZVPP
keywords: def2/J RIJCOSX
keywords: DEFGRID2
keywords: scfconv7
keywords: smallprint printgap noloewdin
keywords: NOSOSCF
formula: C25H29FO2Si
InChI: InChI=1/C25H29FO2Si/c1-4-27-21-13-15-23(16-14-21)29(2,3)18-8-9-20-12-17-24(26)25(19-20)28-22-10-6-5-7-11-22/h5-7,10-17,19H,4,8-9,18H2,1-3H3
58 atoms
Si -3.680638 1.137301 1.042451
F  1.721011 -4.096308 -0.212296
O  1.899981 2.816296 -0.580393
O  1.435045 -1.580911 0.780471
C  -3.758607 -0.754973 0.882404
C  -4.00878 -1.32695 -0.514668
C  -1.96552 1.78776 0.612616
C  -4.054392 1.576325 2.834891
C  -4.946681 1.917723 -0.11021
C  -2.876038 -1.133148 -1.529068
C  -0.895597 1.641488 1.495932
C  -1.670731 2.32804 -0.643471
C  -1.637151 -1.91647 -1.196227
C  0.409373 1.977572 1.153336
C  -0.382425 2.673638 -1.007648
C  0.675771 2.488041 -0.115943
C  -0.632916 -1.369234 -0.40141
C  -1.474941 -3.220365 -1.657602
C  0.48642 -2.105825 -0.059544
C  -0.348106 -3.965445 -1.336295
C  0.622384 -3.400044 -0.537487
C  3.041836 2.690311 0.262029
C  3.178325 3.828929 1.249279
C  2.617725 -1.14409 0.241472
C  3.677022 -0.988538 1.127209
C  2.769349 -0.837285 -1.103138
C  4.898266 -0.532656 0.657747
C  4.001326 -0.383761 -1.557067
C  5.070165 -0.23267 -0.687077
H  -2.857044 -1.192124 1.324712
H  -4.578203 -1.078209 1.533749
H  -4.913176 -0.876904 -0.932552
H  -4.218776 -2.398542 -0.439501
H  -3.341152 1.11649 3.522155
H  -4.019626 2.65452 3.00111
H  -5.048896 1.23091 3.124384
H  -5.951728 1.555433 0.115134
H  -4.962303 3.00482 -0.011622
H  -4.749023 1.687386 -1.158857
H  -3.238747 -1.448092 -2.509595
H  -2.630873 -0.072677 -1.618876
H  -1.062274 1.231341 2.486148
H  -2.460697 2.47544 -1.37132
H  1.194242 1.825833 1.881863
H  -0.18344 3.082232 -1.991024
H  -0.71888 -0.354879 -0.035033
H  -2.236299 -3.665872 -2.285744
H  -0.224621 -4.975661 -1.704395
H  3.891005 2.690011 -0.42051
H  3.040683 1.722851 0.770853
H  2.359292 3.865299 1.967266
H  4.1035 3.699672 1.811818
H  3.230806 4.790587 0.738533
H  3.542996 -1.224643 2.174477
H  1.948145 -0.942596 -1.799862
H  5.721023 -0.414746 1.350112
H  4.117698 -0.146069 -2.605529
H  6.025268 0.120464 -1.050489
elementType: Si F O C H
totalener: -1510.05148671 hartree
nucrepener: 3011.54733454 hartree
electener: -4521.59882124 hartree
oneelecener: -8053.83378664 hartree
twoeener: 3532.23496540 hartree
cpcmener: -0.02547914 hartree
kineticenergy: 1503.93401808 hartree
xcener: -135.241372366837 hartree
chargesum: -0.0000000
charge: 0.503812 -0.220273 -0.350962 -0.333520 -0.279402 -0.157078 -0.109947 -0.464726 -0.441434 -0.116122 -0.154727 -0.130513 -0.023981 -0.239114 -0.284354 0.333633 -0.107693 -0.135694 0.101763 -0.217117 0.307222 0.072210 -0.273392 0.265436 -0.229135 -0.175484 -0.110675 -0.139227 -0.218732 0.083532 0.099478 0.085534 0.092039 0.102931 0.102305 0.103830 0.113343 0.114926 0.102218 0.096959 0.094966 0.135136 0.147941 0.143146 0.135274 0.057527 0.145211 0.149395 0.121002 0.050482 0.093042 0.094763 0.092283 0.142589 0.152500 0.158054 0.160075 0.158744
qa: 0.5038 -0.2203 -0.3510 -0.3335 -0.2794 -0.1571 -0.1099 -0.4647 -0.4414 -0.1161 -0.1547 -0.1305 -0.0240 -0.2391 -0.2844 0.3336 -0.1077 -0.1357 0.1018 -0.2171 0.3072 0.0722 -0.2734 0.2654 -0.2291 -0.1755 -0.1107 -0.1392 -0.2187 0.0835 0.0995 0.0855 0.0920 0.1029 0.1023 0.1038 0.1133 0.1149 0.1022 0.0970 0.0950 0.1351 0.1479 0.1431 0.1353 0.0575 0.1452 0.1494 0.1210 0.0505 0.0930 0.0948 0.0923 0.1426 0.1525 0.1581 0.1601 0.1587
va: 4.1019 1.0669 2.0304 2.0404 3.8249 3.9152 3.6340 3.9090 3.9029 3.7997 3.8570 3.8562 3.6845 3.8210 4.0658 3.6862 3.7261 3.8569 3.8104 3.9476 3.9627 3.8258 3.9678 3.5837 3.9404 3.8130 3.8484 3.8617 3.8804 1.0126 1.0079 1.0010 1.0025 1.0112 1.0110 1.0104 1.0063 1.0087 1.0062 1.0110 1.0138 0.9970 0.9855 1.0011 1.0143 1.0392 0.9987 0.9988 0.9871 1.0089 1.0005 1.0075 1.0055 1.0112 1.0034 0.9891 0.9900 0.9916
dispcorr: -0.035620504 hartree
energy: -1510.087107209570
dipole: -18.29500 17.91009 -0.38491 21.42518 -21.13320 0.29198 4.93431 -5.14116 -0.20685
magnitude: 0.52554 au
magnitude: 1.33582 debye
