program: Orca
programVersion: 5.0.2
elementType: Si F O O C C C C C C C C C C C C C C C C C C C C C C C C C H H H H H H H H H H H H H H H H H H H H H H H H H H H H H
charge: 0
multiplicity: 1
keywords: wb97x-d3
keywords: def2-TZVPP
keywords: def2/J RIJCOSX
keywords: DEFGRID2
keywords: scfconv7
keywords: smallprint printgap noloewdin
keywords: NOSOSCF
formula: C25H29FO2Si
InChI: InChI=1/C25H29FO2Si/c1-4-27-21-13-15-23(16-14-21)29(2,3)18-8-9-20-12-17-24(26)25(19-20)28-22-10-6-5-7-11-22/h5-7,10-17,19H,4,8-9,18H2,1-3H3
58 atoms
Si -3.570582 1.804904 0.611157
F  1.24134 -5.597789 0.225049
O  2.25812 3.416477 0.931153
O  2.044135 -3.112332 -0.131649
C  -3.61528 0.432796 -0.691473
C  -2.73525 -0.751358 -0.299096
C  -1.780112 2.377587 0.754015
C  -4.142179 1.125016 2.270259
C  -4.651462 3.25024 0.080568
C  -2.521978 -1.767019 -1.423763
C  -0.8789 1.783636 1.646791
C  -1.265909 3.360751 -0.090242
C  -1.531025 -2.826641 -1.028692
C  0.456599 2.142196 1.688701
C  0.071423 3.741589 -0.066347
C  0.944555 3.126749 0.827383
C  -0.203218 -2.458043 -0.802099
C  -1.902435 -4.149738 -0.835427
C  0.735055 -3.38722 -0.389007
C  -0.969635 -5.092918 -0.414837
C  0.329902 -4.704751 -0.193139
C  2.833091 4.344038 0.016898
C  4.310991 4.430943 0.303728
C  2.528584 -1.854801 -0.428819
C  2.715301 -1.46844 -1.748434
C  2.86079 -1.013143 0.619463
C  3.239448 -0.211712 -2.014247
C  3.399862 0.236144 0.340357
C  3.582786 0.642788 -0.973938
H  -4.64533 0.104327 -0.864986
H  -3.267604 0.854742 -1.641447
H  -3.16154 -1.263547 0.568363
H  -1.754206 -0.387912 0.021783
H  -5.166727 0.752538 2.204459
H  -3.520364 0.296432 2.614466
H  -4.123179 1.892287 3.046783
H  -5.69419 2.942027 -0.019588
H  -4.619475 4.06326 0.8085
H  -4.343022 3.659851 -0.883127
H  -3.473401 -2.22854 -1.697402
H  -2.16091 -1.238824 -2.311036
H  -1.218698 1.014229 2.330969
H  -1.915494 3.85904 -0.801438
H  1.130917 1.663008 2.388383
H  0.409078 4.512272 -0.74601
H  0.088491 -1.425372 -0.949718
H  -2.92618 -4.456537 -1.007466
H  -1.254754 -6.125352 -0.25856
H  2.364908 5.326818 0.131735
H  2.661383 4.012838 -1.01236
H  4.504167 4.784473 1.316789
H  4.803988 3.466906 0.171676
H  4.770023 5.136954 -0.387857
H  2.452789 -2.137828 -2.558052
H  2.707909 -1.333129 1.642254
H  3.384835 0.097367 -3.040934
H  3.6709 0.892152 1.156485
H  3.999513 1.618488 -1.188395
elementType: Si F O C H
totalener: -1510.05415168 hartree
nucrepener: 2881.75077755 hartree
electener: -4391.80492923 hartree
oneelecener: -7793.99476052 hartree
twoeener: 3402.18983128 hartree
cpcmener: -0.02869242 hartree
kineticenergy: 1503.90799835 hartree
xcener: -135.229138116604 hartree
chargesum: -0.0000000
charge: 0.507717 -0.223228 -0.338557 -0.342763 -0.254623 -0.114753 -0.174946 -0.434013 -0.458973 -0.066114 -0.090434 -0.140987 -0.028123 -0.326275 -0.259595 0.357324 -0.220522 -0.218054 0.247915 -0.154074 0.172798 0.027792 -0.276357 0.258016 -0.178313 -0.195873 -0.161752 -0.175649 -0.142255 0.085450 0.075337 0.088960 0.065000 0.108364 0.101738 0.110449 0.105339 0.105713 0.101926 0.081458 0.090713 0.147379 0.140074 0.141599 0.141349 0.138191 0.142467 0.149673 0.112749 0.102768 0.093844 0.085404 0.095619 0.157294 0.149605 0.162228 0.155520 0.168463
qa: 0.5077 -0.2232 -0.3386 -0.3428 -0.2546 -0.1148 -0.1749 -0.4340 -0.4590 -0.0661 -0.0904 -0.1410 -0.0281 -0.3263 -0.2596 0.3573 -0.2205 -0.2181 0.2479 -0.1541 0.1728 0.0278 -0.2764 0.2580 -0.1783 -0.1959 -0.1618 -0.1756 -0.1423 0.0855 0.0753 0.0890 0.0650 0.1084 0.1017 0.1104 0.1053 0.1057 0.1019 0.0815 0.0907 0.1474 0.1401 0.1416 0.1413 0.1382 0.1425 0.1497 0.1127 0.1028 0.0938 0.0854 0.0956 0.1573 0.1496 0.1622 0.1555 0.1685
va: 4.1320 1.0583 2.0407 2.0618 3.8416 3.8774 3.7274 3.8922 3.9177 3.8041 3.8012 3.9284 3.7674 4.0072 3.9282 3.6967 3.8806 3.9035 3.6512 3.8776 4.0414 3.7938 3.9633 3.6860 3.9376 3.9949 3.9324 3.8588 3.8167 1.0151 1.0165 1.0055 1.0060 1.0075 1.0083 1.0076 1.0104 1.0093 1.0107 1.0143 1.0060 0.9874 0.9906 1.0090 1.0102 1.0068 1.0037 0.9978 0.9896 0.9838 1.0030 1.0014 1.0055 0.9962 1.0037 0.9900 1.0019 0.9810
dispcorr: -0.030814412 hartree
energy: -1510.084966096314
dipole: -16.00843 15.36064 -0.64780 33.85213 -31.95263 1.89951 -1.07392 -0.03992 -1.11385
magnitude: 2.29530 au
magnitude: 5.83420 debye
