program: Orca
programVersion: 5.0.2
elementType: Si F O O C C C C C C C C C C C C C C C C C C C C C C C C C H H H H H H H H H H H H H H H H H H H H H H H H H H H H H
charge: 0
multiplicity: 1
keywords: wb97x-d3
keywords: def2-TZVPP
keywords: def2/J RIJCOSX
keywords: DEFGRID2
keywords: scfconv7
keywords: smallprint printgap noloewdin
keywords: NOSOSCF
formula: C25H29FO2Si
InChI: InChI=1/C25H29FO2Si/c1-4-27-21-13-15-23(16-14-21)29(2,3)18-8-9-20-12-17-24(26)25(19-20)28-22-10-6-5-7-11-22/h5-7,10-17,19H,4,8-9,18H2,1-3H3
58 atoms
Si -2.693406 1.354803 0.962857
F  1.000914 -5.383981 -0.075882
O  2.382847 4.086405 -0.886045
O  1.809047 -2.85157 -0.569357
C  -2.776898 -0.329184 0.111772
C  -2.647625 -0.288598 -1.4089
C  -1.133708 2.241154 0.390188
C  -2.609715 1.069179 2.822969
C  -4.185281 2.418755 0.532202
C  -2.727145 -1.665295 -2.072756
C  0.067989 1.545471 0.206813
C  -1.111974 3.609255 0.127854
C  -1.724262 -2.664268 -1.557491
C  1.223084 2.177591 -0.214044
C  0.037082 4.269584 -0.295512
C  1.215537 3.550132 -0.471664
C  -0.40202 -2.298603 -1.319812
C  -2.097782 -3.980067 -1.295979
C  0.510104 -3.212049 -0.820146
C  -1.186797 -4.911222 -0.816389
C  0.110328 -4.514375 -0.571827
C  2.424179 5.471161 -1.21245
C  3.816642 5.797834 -1.690041
C  2.033609 -1.986186 0.473217
C  1.17134 -1.873946 1.556901
C  3.194006 -1.225978 0.410318
C  1.478724 -0.982753 2.57666
C  3.489283 -0.345982 1.440365
C  2.632033 -0.213474 2.525017
H  -1.987486 -0.954365 0.543682
H  -3.717973 -0.815296 0.393264
H  -1.711123 0.199626 -1.691307
H  -3.439596 0.333298 -1.835261
H  -1.725499 0.485968 3.090662
H  -2.559034 2.010652 3.37334
H  -3.483873 0.524007 3.185308
H  -4.236678 2.637806 -0.535979
H  -5.114316 1.915223 0.807374
H  -4.168826 3.373385 1.061518
H  -3.730094 -2.076135 -1.93514
H  -2.595341 -1.544927 -3.152525
H  0.111923 0.476956 0.388283
H  -2.013552 4.199615 0.24583
H  2.13697 1.612797 -0.353072
H  -0.010181 5.333533 -0.484164
H  -0.066049 -1.284426 -1.504647
H  -3.121505 -4.288873 -1.465635
H  -1.488762 -5.930388 -0.613247
H  2.170032 6.074197 -0.33488
H  1.690323 5.696153 -1.992786
H  3.869859 6.856207 -1.94376
H  4.562169 5.602225 -0.91914
H  4.079488 5.228517 -2.581734
H  0.266151 -2.464101 1.618455
H  3.857564 -1.322124 -0.439319
H  0.801631 -0.891977 3.415835
H  4.391908 0.247869 1.384978
H  2.861633 0.482329 3.320361
elementType: Si F O C H
totalener: -1510.05376222 hartree
nucrepener: 2918.11396935 hartree
electener: -4428.16773157 hartree
oneelecener: -7866.66588944 hartree
twoeener: 3438.49815787 hartree
cpcmener: -0.02767654 hartree
kineticenergy: 1503.92356482 hartree
xcener: -135.234831862559 hartree
chargesum: -0.0000000
charge: 0.451824 -0.219245 -0.338005 -0.348215 -0.270994 -0.116205 -0.219447 -0.411263 -0.443775 -0.110445 -0.027734 -0.080177 0.014047 -0.329612 -0.298428 0.372624 -0.230212 -0.166733 0.196236 -0.181851 0.216006 0.067060 -0.275190 0.282638 -0.157158 -0.212833 -0.183321 -0.159226 -0.174762 0.080563 0.094827 0.079147 0.093418 0.096256 0.102113 0.103352 0.107479 0.110112 0.104768 0.083678 0.093925 0.110444 0.142516 0.137837 0.139954 0.146966 0.143838 0.150880 0.094381 0.094718 0.090372 0.087571 0.086991 0.150480 0.147073 0.161719 0.159498 0.159522
qa: 0.4518 -0.2192 -0.3380 -0.3482 -0.2710 -0.1162 -0.2194 -0.4113 -0.4438 -0.1104 -0.0277 -0.0802 0.0140 -0.3296 -0.2984 0.3726 -0.2302 -0.1667 0.1962 -0.1819 0.2160 0.0671 -0.2752 0.2826 -0.1572 -0.2128 -0.1833 -0.1592 -0.1748 0.0806 0.0948 0.0791 0.0934 0.0963 0.1021 0.1034 0.1075 0.1101 0.1048 0.0837 0.0939 0.1104 0.1425 0.1378 0.1400 0.1470 0.1438 0.1509 0.0944 0.0947 0.0904 0.0876 0.0870 0.1505 0.1471 0.1617 0.1595 0.1595
va: 4.1470 1.0669 2.0713 2.0624 3.8608 3.8470 3.7636 3.8824 3.9165 3.8522 3.7341 3.8114 3.6560 4.0309 3.9239 3.7843 3.9298 3.8916 3.6582 3.8837 4.0492 3.7914 3.9734 3.6485 3.7855 3.9300 3.8563 3.8689 3.8533 1.0092 1.0154 1.0034 1.0069 1.0109 1.0097 1.0085 1.0068 1.0080 1.0085 1.0077 1.0029 0.9690 0.9883 1.0249 1.0128 1.0024 0.9997 0.9973 0.9859 0.9868 1.0056 1.0030 1.0033 1.0067 1.0070 0.9904 0.9891 0.9900
dispcorr: -0.032646432 hartree
energy: -1510.086408655953
dipole: -14.55149 13.15581 -1.39568 34.21029 -32.57990 1.63040 1.20097 -1.41664 -0.21568
magnitude: 2.15699 au
magnitude: 5.48264 debye
